program: Gaussian 16
title: X-n
version: ES64L-G16RevC.01
frameworkgroup: C1[X(C9H10O2)]
method: RPBE1PBE
basis: def2TZVPP
operation: Freq
keyword: #N
keyword: Geom=AllCheck
keyword: Guess=TCheck
keyword: SCRF=Check
keyword: GenChk
keyword: RPBE1PBE/def2TZVPP
keyword: Freq
converged: YES YES NO YES
title: Mulliken charges:
elementType: C C C C H C C H H C C C O O H H H H H H H
charge: -0.252685 0.221168 0.254801 -0.256034 0.136838 -0.175487 0.048175 0.076637 0.073970 -0.157366 0.042341 -0.093950 -0.319221 -0.321267 0.103840 0.096635 0.099545 0.137381 0.094345 0.084084 0.106251
chargesum: -0.00000
title: Mulliken charges with hydrogens summed into heavy atoms:
elementType: C C C C C C C C C O O
charge: -0.115848 0.295138 0.331438 -0.118653 0.015492 0.048175 0.048430 0.042341 0.093974 -0.319221 -0.321267
chargesum: 0.00000
1716.lowfreq: -4.5229 0.0004 0.0005 0.0011 5.8690 20.1498 81.7432 106.8347 184.4734
frequency: 81.4150 106.7524 184.4614 262.3246 296.9930 311.7615 410.3579 450.8999 475.3321 509.2402 534.8235 611.4931 625.8367 664.9252 713.5297 756.9257 806.7755 865.2073 906.2753 918.7348 922.9874 960.0660 993.6667 1008.9461 1038.4466 1057.5233 1080.2736 1136.9232 1167.4073 1175.1696 1217.1503 1230.2561 1250.9571 1280.0476 1291.9844 1297.6513 1336.2731 1352.0917 1354.1061 1372.8414 1392.4827 1417.5803 1452.1152 1474.8620 1714.1979 1792.5555 1804.8074 3034.6600 3064.2923 3065.7935 3111.8231 3113.5221 3119.2686 3123.8389 3128.2291 3189.4720 3212.5461
redmass: 7.3431 4.8926 2.4330 2.4424 2.5591 4.0717 3.9873 4.8511 4.2974 4.7574 3.2163 2.3475 2.9461 4.3761 1.8780 2.6966 1.9444 2.7314 2.4035 2.9810 2.9567 2.8456 1.4438 1.9217 1.8529 1.6551 1.9412 1.5281 1.4289 1.2873 1.3878 2.1212 1.5125 1.6745 1.5591 1.6825 1.4912 1.5164 1.5865 1.6053 1.5901 1.1028 1.0813 1.0924 6.6824 11.3289 11.9170 1.0685 1.0601 1.0619 1.1013 1.1011 1.0885 1.0868 1.0957 1.0868 1.1008
irintensity: 14.4276 8.0678 0.2907 0.8592 2.5012 1.0916 8.6717 19.0493 6.0471 2.8135 3.4838 2.5114 12.7366 4.6556 69.5345 16.9523 16.7229 22.5220 6.9054 14.8914 22.4433 10.4924 0.8514 2.6460 17.2773 11.4398 14.8001 22.5780 10.3534 21.9711 3.9494 51.4457 25.2638 10.0532 4.3520 18.8764 3.7811 11.1496 20.3092 7.9268 2.3111 20.3595 21.4080 12.8980 6.3374 480.7484 293.1858 7.0251 37.0366 8.3625 14.7910 8.9486 32.6683 9.1400 18.4825 2.6442 12.2085
temp: 298.150 k
press: 1.00000 atm
elementType: 6 6 6 6 1 6 6 1 1 6 6 6 8 8 1 1 1 1 1 1 1
symmnumber: 1
zpe: 455961.9 jmol-1
zpe.correction: 0.173667 hartree
zpe.thermalcorrener: 0.182426 hartree
zpe.thermalcorrenthalpy: 0.183370 hartree
zpe.thermalcorrgfe: 0.139912 hartree
zpe.sumelectzpe: -498.886405 hartree
zpe.sumelectthermal: -498.877646 hartree
zpe.sumelectthermalent: -498.876702 hartree
zpe.sumelectthermalfe: -498.920159 hartree
dipole: -0.5694 -0.3786 1.6976
dipole: 1.8301
quadrupole: -87.5581 -57.9136 -60.5357
quadrupole: -0.6998 -4.2096 1.1514
quadrupole: -18.8889 10.7555 8.1334 -0.6998 -4.2096 1.1514
hfenergy: -499.0600713 hartree
pointgroup: C01 [X(C9H10O2)]
dipole: 0.344993 0.6318771 0.0127512 debye
dipolederiv: -0.1232024 -0.0798992 0.159371 -0.0161816 0.0928184 -0.1218126 0.2637828 -0.1610664 -0.057256 0.1138241 0.018932 0.1441067 0.1513883 -0.292812 -0.104357 0.0630577 -0.1954501 -0.1764521 -0.0649447 -0.0596342 0.0958022 -0.2712701 -0.1048717 0.1273268 0.3240855 0.1383438 -0.0655643 -0.1153476 0.1345456 0.116686 0.1731997 0.1743131 -0.0923909 0.1823346 -0.0084275 -0.2556229 0.1054392 -0.0513611 -0.065776 -0.0659948 -0.0766175 0.0212126 -0.0769512 0.0137784 0.1454498 0.173863 -0.0085084 -0.072551 0.0487135 0.0834869 0.0112554 -0.037131 0.0515183 0.2107117 1.7435798 -0.0345632 -0.0211888 -0.1842073 0.1840301 -0.2952732 -0.2219947 -0.3500707 1.0369538 -0.039466 -0.005609 -0.0992697 0.0034539 0.0646027 -0.0213616 -0.0694499 -0.0181915 -0.0276854 -0.1075037 -0.0486578 -0.0751929 -0.0005411 0.0418551 -0.0003919 -0.041811 0.0021674 0.039155 -0.1313036 -0.0524879 -0.2267381 -0.139394 0.0382637 -0.14456 -0.302949 -0.0659795 -0.2546476 1.1704574 -0.4644145 0.3509196 -0.6275089 1.0592315 0.3564854 0.241498 0.3341548 0.6610338 -0.1450558 0.0511376 -0.1592397 0.1096067 0.049299 0.15734 -0.1852195 0.1408757 -0.2667254 -1.6157351 0.0218794 -0.0289575 0.1814511 -0.3702129 0.0691944 0.0357092 0.0726808 -0.6624142 -1.1560389 0.4687861 -0.1621215 0.5508214 -0.9202691 -0.0372028 -0.1273774 -0.035985 -0.5187679 0.0775657 0.0518322 -0.0157228 0.0151862 -0.0533001 -0.0600733 -0.0486388 -0.068892 0.0634117 0.0004869 0.0281978 -0.0826366 0.0510549 0.0234107 0.1295974 -0.0835249 0.0788272 -0.0965244 0.0470359 -0.0061072 -0.021501 -0.0159193 -0.0930827 0.002016 0.0063241 0.0569765 0.1268043 0.0892201 0.006422 -0.0814853 0.0143691 -0.0332344 0.088105 -0.0750474 0.0830265 0.1038725 0.0130088 0.0410501 0.0493953 0.0013284 -0.0855174 -0.1031524 0.0328058 -0.0801012 0.0209808 -0.0485398 -0.0341899 0.1247738 0.0006417 0.0995565 -0.0148105 0.0690878 0.016229 -0.0304255 0.0126567 0.0226496 0.0713263 0.0198021 0.1190501 0.0328531 0.0514095 -0.0044145 0.0037123 unknown
polarizability: 140.7293246|-0.5733536|120.6844302|10.6548851|-0.2588166|127.0695038 unknown
InChI: InChI=1S/C9H10O2/c10-8-4-3-6-1-2-7(8)5-9(6)11/h1-2,6-7H,3-5H2
charge 0 multiplicity 1
21 atoms
C  0.73773062 1.73383435 -0.21617271
C  1.26835786 0.61551589 0.6365081
C  -0.84665597 0.1057962 -1.09669554
C  -0.28333272 1.50424972 -1.03246578
H  1.18599809 2.71646507 -0.12139952
C  0.30013558 0.32115382 1.80182177
C  -1.68384894 -0.05457465 0.16286951
H  -1.51798098 -0.00389902 -1.9470155
H  2.24554396 0.86319972 1.0494926
C  0.3019911 -0.89674818 -1.18836832
C  1.40948207 -0.64454123 -0.19391391
C  -0.96393801 -0.46188317 1.42437496
O  -2.87989498 0.12564683 0.14148846
O  2.33725255 -1.40662526 -0.05874468
H  -0.69810295 -1.51733999 1.28231913
H  0.83079035 -0.24782212 2.56805673
H  -0.03723198 -1.92872229 -1.07184284
H  -0.73906226 2.286179 -1.62773878
H  0.01494295 1.27734681 2.24610145
H  -1.6820644 -0.42831569 2.24362821
H  0.75218062 -0.82519386 -2.18290717
