program: Gaussian 16
title: W-n
version: ES64L-G16RevC.01
frameworkgroup: C1[X(C9H8O2)]
method: RPBE1PBE
basis: def2TZVPP
operation: Freq
keyword: #N
keyword: Geom=AllCheck
keyword: Guess=TCheck
keyword: SCRF=Check
keyword: GenChk
keyword: RPBE1PBE/def2TZVPP
keyword: Freq
converged: YES YES YES YES
title: Mulliken charges:
elementType: C C C C H C C H H C C C O O H H H H H
charge: -0.243260 0.301696 0.276086 -0.264071 0.147271 -0.185884 0.120066 0.067516 0.080705 -0.175989 0.063489 -0.196119 -0.328609 -0.306756 0.125623 0.148768 0.112725 0.144022 0.112721
chargesum: 0.00000
title: Mulliken charges with hydrogens summed into heavy atoms:
elementType: C C C C C C C C C O O
charge: -0.095988 0.382401 0.343601 -0.120049 -0.037116 0.120066 0.049457 0.063489 -0.070496 -0.328609 -0.306756
1716.lowfreq: -14.7255 -9.7327 -0.0008 -0.0002 0.0008 4.6282 71.2916 111.2001 249.3442
frequency: 71.2299 111.1531 249.3359 289.2978 327.1533 348.3059 429.9249 452.3947 488.9620 518.8739 580.8713 602.6723 684.5404 707.0984 720.2019 792.0506 837.2482 876.7261 914.1282 930.0285 941.6157 974.0536 990.3969 1027.8070 1040.5395 1067.0929 1118.0984 1171.3023 1183.0084 1208.0035 1258.0214 1272.4445 1284.9170 1310.8909 1340.0015 1351.6868 1377.5845 1410.2639 1422.4232 1683.8426 1712.0561 1755.9111 1812.8165 3075.9242 3122.1772 3132.6210 3145.4618 3180.5529 3198.5735 3199.3519 3219.4465
redmass: 7.8045 5.3128 2.7291 2.6114 5.2740 3.2489 6.4975 4.8983 4.9457 5.6535 2.8438 3.2208 2.8832 1.6626 4.2042 2.6730 2.8055 3.1099 3.3239 2.6292 2.6043 2.6954 1.4479 1.3465 2.0953 1.9093 1.8546 1.3656 1.5178 1.1818 1.4590 1.7182 1.6533 1.7153 1.5130 1.5113 1.6539 1.6500 1.1231 6.8845 7.0121 10.4566 12.1213 1.0611 1.1024 1.0868 1.0871 1.0865 1.0925 1.0906 1.1023
irintensity: 12.8122 5.8283 0.7541 3.9138 3.6975 3.4987 13.1984 12.8872 3.8625 6.8291 1.6930 3.2995 42.5975 83.0494 1.5678 31.0735 33.8259 17.4226 32.3464 21.1322 8.2152 11.5192 0.1511 0.2862 20.7174 2.3137 38.2928 25.1798 39.9652 26.6280 5.0013 13.9613 28.1054 10.7306 14.7920 15.5244 6.2830 26.5134 31.7187 42.5590 47.1187 562.4196 417.4659 7.3856 2.0873 12.0153 8.8228 2.9468 4.8190 5.0860 7.8259
temp: 298.150 k
press: 1.00000 atm
elementType: 6 6 6 6 1 6 6 1 1 6 6 6 8 8 1 1 1 1 1
symmnumber: 1
zpe: 394295.6 jmol-1
zpe.correction: 0.150179 hartree
zpe.thermalcorrener: 0.158535 hartree
zpe.thermalcorrenthalpy: 0.159479 hartree
zpe.thermalcorrgfe: 0.116763 hartree
zpe.sumelectzpe: -497.683756 hartree
zpe.sumelectthermal: -497.675400 hartree
zpe.sumelectthermalent: -497.674456 hartree
zpe.sumelectthermalfe: -497.717172 hartree
dipole: 1.3395 0.0041 -2.5981
dipole: 2.9231
quadrupole: -84.3095 -54.4930 -61.7925
quadrupole: 1.7767 -3.9074 -0.3829
quadrupole: -17.4445 12.3720 5.0725 1.7767 -3.9074 -0.3829
hfenergy: -497.8339349 hartree
pointgroup: C01 [X(C9H8O2)]
dipole: 0.5705729 0.9967681 0.0592339 debye
dipolederiv: -0.2203698 -0.1290741 0.1677989 -0.0477545 0.1293561 -0.113542 0.0985129 -0.2692936 -0.0304214 0.0055241 0.0609984 0.1710685 0.3196781 -0.2721472 -0.0363493 0.5478707 -0.0639472 -0.3143816 -0.0788873 -0.0657392 0.1311041 -0.2090314 -0.0996016 0.0923429 0.2745438 0.1471209 -0.0146654 -0.0650961 0.1767588 0.1030624 0.1557233 0.1704119 -0.0838757 0.1956562 0.0233178 -0.2359498 0.1380401 -0.0349381 -0.0689161 -0.088726 -0.0608078 0.0246776 -0.0540667 0.0223597 0.1423494 0.4843125 0.1560427 -0.1124276 0.2549621 -0.1514922 -0.1478931 -0.2302679 -0.0888792 0.2518091 1.8713521 0.3860128 0.1390706 0.3414962 0.2655433 -0.1071935 0.3349825 -0.0915961 1.0803743 -0.0158592 -0.0124219 -0.0969537 -0.0081392 0.0610834 -0.0208725 -0.0670096 -0.0134522 -0.0188234 -0.0570905 -0.0335649 -0.0681423 -0.010508 0.0570382 0.0060855 -0.0477848 -0.0071077 0.0368258 -0.1483309 -0.0604308 -0.195066 -0.1193552 0.0180798 -0.1526064 -0.2486385 -0.0964633 -0.2487943 1.4174216 -0.5490635 0.1365415 -0.987289 0.9575845 0.5010272 -0.136057 0.4525506 0.741003 -0.5091545 -0.0125232 -0.1855675 -0.0065576 -0.1810298 -0.0403261 -0.5146001 -0.1126681 -0.3790023 -1.7216232 -0.3029162 -0.1213401 -0.2846715 -0.4487816 -0.0012651 -0.1603171 0.0052851 -0.6646418 -1.4181501 0.4796486 -0.0441505 0.6955284 -0.773972 -0.1373083 0.0158835 -0.1068642 -0.5015659 0.0225719 -0.0588701 0.0684166 -0.0411186 0.1542658 0.0703692 0.0399168 0.0445081 -0.0024949 0.0867856 -0.0196958 -0.003863 -0.0208022 0.1488637 0.042429 -0.0465931 0.0338135 -0.0658942 0.0654617 0.0007631 -0.0233415 0.0094353 -0.0674703 0.0027171 0.0175645 0.0496878 0.1169212 0.1113847 0.0062337 -0.0710756 0.0165294 -0.0203587 0.0793792 -0.0743111 0.0813363 0.1020115 0.0317072 0.0127797 0.0737812 0.0306002 0.1134346 0.0222041 0.054715 -0.0097082 0.0053405 unknown
polarizability: 157.2714527|7.0473583|111.6596193|12.076744|1.7743303|124.6820434 unknown
InChI: InChI=1S/C9H8O2/c10-8-4-3-6-1-2-7(8)5-9(6)11/h1-4,6-7H,5H2
charge 0 multiplicity 1
19 atoms
C  0.69861016 1.75169699 -0.15675064
C  1.23756596 0.61603414 0.67511852
C  -0.83140877 0.0984524 -1.08299849
C  -0.30408464 1.50721345 -0.98781483
H  1.15385815 2.72912382 -0.05388091
C  0.26159944 0.1178294 1.700007
C  -1.66816386 -0.213079 0.14586115
H  -1.49086974 -0.01390709 -1.94137956
H  2.17967428 0.8730377 1.15274997
C  0.35051123 -0.86913735 -1.21249316
C  1.48606281 -0.57026347 -0.26857833
C  -1.00583256 -0.2358538 1.45872776
O  -2.85413224 -0.46144094 0.0496861
O  2.51076104 -1.20077872 -0.24477235
H  -1.6319302 -0.57649013 2.2765843
H  0.64364615 0.01431527 2.7103788
H  0.04597306 -1.90863673 -1.06918845
H  -0.75365174 2.28159907 -1.5973206
H  0.75783947 -0.7968416 -2.22361819
