program: Gaussian 16
title: Y
version: ES64L-G16RevC.01
frameworkgroup: C1[X(C10H9O)]
method: RPBE1PBE
basis: def2TZVPP
operation: Freq
keyword: #N
keyword: Geom=AllCheck
keyword: Guess=TCheck
keyword: SCRF=Check
keyword: GenChk
keyword: RPBE1PBE/def2TZVPP
keyword: Freq
converged: YES YES NO YES
title: Mulliken charges:
elementType: C C C C H C C H H C C C O H H H H C H H
charge: -0.325812 0.330694 0.344662 -0.226886 0.118120 -0.267421 -0.091267 0.045810 0.025444 -0.592781 0.072699 -0.177245 -0.549555 0.106165 0.121808 0.055723 0.116140 -0.300345 0.096838 0.097209
chargesum: -1.00000
title: Mulliken charges with hydrogens summed into heavy atoms:
elementType: C C C C C C C C C O C
charge: -0.207692 0.356138 0.390472 -0.110746 -0.145613 -0.091267 -0.537058 0.072699 -0.071081 -0.549555 -0.106298
1716.lowfreq: -44.4257 -25.2226 -19.0023 -0.0009 -0.0007 0.0004 88.9045 146.8710 270.9911
frequency: 87.4173 146.6494 270.9319 329.0064 354.3651 362.0994 392.0009 435.2594 495.1122 527.2808 547.6765 578.9737 652.7966 674.2470 726.5388 734.5971 760.8252 790.8419 819.3197 875.8301 883.6197 912.8694 936.9411 948.5725 974.7969 990.8820 995.4777 1030.6923 1050.1784 1129.6789 1184.3464 1204.7044 1228.6167 1267.6374 1292.5200 1314.7213 1328.0752 1365.7975 1375.8344 1396.3454 1442.3596 1640.5000 1646.9083 1688.7144 1709.8193 3069.6072 3106.9915 3133.9503 3143.0515 3158.6633 3164.7287 3169.2581 3185.1882 3221.3575
redmass: 4.9985 4.7604 2.7794 3.2605 3.2813 3.0782 2.9352 5.0599 4.0531 3.9389 1.4693 2.9621 2.3399 2.1715 2.7139 1.6346 4.0448 2.3311 2.2164 2.6310 1.6187 2.9638 2.3792 4.2194 1.4077 1.6094 1.4523 2.0766 1.7575 1.1160 1.2584 1.4361 1.4292 1.5032 1.8571 1.7466 1.5479 2.5665 1.9277 1.6216 1.3791 6.9056 6.2815 6.3345 6.7495 1.0851 1.0857 1.0595 1.0845 1.0845 1.0891 1.0953 1.1020 1.1157
irintensity: 3.0016 0.2522 23.9516 1.8214 4.1292 5.6119 3.3165 1.8833 34.9154 7.2046 59.7077 11.1973 79.1203 66.6217 39.1738 1.3011 18.3713 1.5559 17.7335 21.0421 93.5709 34.9546 58.4405 34.5422 1.1242 13.5229 8.3985 30.5805 24.7855 4.5784 18.7637 57.5971 1.6835 1.7062 4.5678 0.2115 10.6904 151.7502 28.4707 19.0512 4.1390 292.6753 632.9372 60.7523 23.0773 62.0362 54.1264 13.6969 19.0982 21.5894 84.5319 60.9373 45.3564 22.3267
temp: 298.150 k
press: 1.00000 atm
elementType: 6 6 6 6 1 6 6 1 1 6 6 6 8 1 1 1 1 6 1 1
symmnumber: 1
zpe: 417826.7 jmol-1
zpe.correction: 0.159142 hartree
zpe.thermalcorrener: 0.167618 hartree
zpe.thermalcorrenthalpy: 0.168562 hartree
zpe.thermalcorrgfe: 0.126119 hartree
zpe.sumelectzpe: -461.224173 hartree
zpe.sumelectthermal: -461.215697 hartree
zpe.sumelectthermalent: -461.214753 hartree
zpe.sumelectthermalfe: -461.257196 hartree
dipole: -6.3758 1.8146 -4.6369
dipole: 8.0898
quadrupole: -89.7587 -68.8776 -76.4248
quadrupole: 4.4505 -11.9594 1.0921
quadrupole: -11.4050 9.4761 1.9289 4.4505 -11.9594 1.0921
hfenergy: -461.3833151 hartree
pointgroup: C01 [X(C10H9O1)]
dipole: -2.4988884 1.635097 1.1009084 debye
dipolederiv: -0.219084 -0.2387831 0.1543675 -0.1040175 0.2549657 -0.0456166 0.0664248 -0.2316013 -0.0840997 0.0950461 0.0938182 0.2374255 0.3476216 -0.2789332 -0.0529592 0.8191337 -0.1160715 -0.2884807 0.1772178 -0.0918821 -0.0690778 -0.0576793 0.1068423 -0.0923449 0.1028146 0.0096401 0.3683296 -0.1303738 0.1635543 0.1609196 0.0875315 0.1724936 -0.0154655 0.218731 0.1195979 -0.259003 0.1601909 -0.0582181 -0.0758039 -0.1363704 -0.1817844 -0.0452219 -0.10678 -0.0333527 0.1335327 0.3000624 0.1566032 -0.2537666 0.256038 -0.2083918 -0.2286753 -0.3820561 -0.1959102 0.1718067 0.7758514 0.2295984 -0.0250664 0.1890675 -0.0976727 -0.0431589 0.0405399 -0.0846233 0.1283368 -0.0712435 0.0016265 -0.1543995 -0.0174458 0.0471893 -0.0160443 -0.1361226 0.0034644 -0.1242916 -0.1898187 -0.0694223 -0.126706 -0.0270051 0.0308443 -0.0002829 -0.0745638 -0.0125319 0.0028667 -0.9246031 -0.0623499 -0.0845854 -0.1993376 -0.3501561 0.2623568 -0.3078943 0.3738061 -0.9325121 2.0619809 -0.7008681 0.6178758 -1.401528 0.6221737 0.2605033 0.1094183 0.3273215 0.7427781 -0.1725437 0.0661259 0.0683598 0.0417075 -0.1636582 -0.0218793 -0.0543928 -0.0446331 0.0054512 -2.2858684 0.5945506 -0.340326 1.2033382 -0.9171589 0.0475361 -0.0778107 -0.0769872 -0.623979 -0.0026558 -0.0874609 0.112649 -0.0849858 0.1195964 0.1042454 0.0794387 0.0816637 -0.0798041 0.067797 -0.0367947 -0.0357007 -0.0298452 0.1428384 0.0822344 -0.0985689 0.053714 -0.1755252 0.024917 0.0679831 -0.0696666 0.0602405 -0.0724701 -0.2906808 0.0295064 -0.2243081 0.0402645 0.0755517 0.0890349 -0.1040251 0.0779609 -0.1171135 0.078769 -0.0901058 0.0693782 0.1057461 -0.7343163 0.0110446 -0.0038287 -0.041343 -0.4379648 -0.1107529 -0.1189305 -0.1422266 0.0387423 -0.0264765 -0.0857156 0.0272102 -0.1312785 0.1711385 0.089559 0.1150986 0.1055711 -0.0694208 0.0183686 -0.0424448 -0.0358547 -0.0326697 0.1572215 0.0378784 -0.1338806 0.0180891 -0.1007386 unknown
polarizability: 231.2674377|16.5440057|137.038721|22.1232355|4.6486056|154.1803683 unknown
InChI: InChI=1S/C10H9O/c1-7-2-3-8-4-5-9(7)6-10(8)11/h2-6,8-9H,1H2
charge -1 multiplicity 1
20 atoms
C  0.64362556 1.75911404 0.03005211
C  1.24559865 0.52864714 0.65376658
C  -0.79488728 0.15992386 -1.08176002
C  -0.37638417 1.58484392 -0.79978614
H  1.0252638 2.73971213 0.29818697
C  0.29310382 -0.03512038 1.67051295
C  -1.61797282 -0.33381776 0.09720987
H  -1.4367365 0.13158799 -1.96541592
H  2.20618434 0.74420234 1.11968051
C  0.42246956 -0.71378454 -1.2865888
C  1.4904054 -0.58568891 -0.43153874
C  -0.96709053 -0.40766892 1.40497417
O  2.57203088 -1.22260083 -0.35786628
H  -1.57138899 -0.81353123 2.21274191
H  0.66426175 -0.16765693 2.68297299
H  0.36294208 -1.53485266 -1.99436839
H  -0.91588882 2.41106445 -1.25236053
C  -2.89127519 -0.72927992 -0.04554974
H  -3.46116209 -1.11398588 0.79511638
H  -3.38989611 -0.69159752 -1.00837106
