program: Gaussian 16
title: Z-n
version: ES64L-G16RevC.01
frameworkgroup: C1[X(C9H10O2)]
method: RPBE1PBE
basis: def2TZVPP
operation: Freq
keyword: #N
keyword: Geom=AllCheck
keyword: Guess=TCheck
keyword: SCRF=Check
keyword: GenChk
keyword: RPBE1PBE/def2TZVPP
keyword: Freq
converged: YES YES NO YES
title: Mulliken charges:
elementType: C C C C H C C H H C C C O O H H H H H H H
charge: -0.172834 0.243055 0.231670 -0.237025 0.088345 -0.193884 0.113214 0.057264 0.068035 -0.157304 0.050873 -0.206752 -0.334959 -0.316143 0.122816 0.143577 0.105121 0.091364 0.096995 0.099557 0.107014
chargesum: -0.00000
title: Mulliken charges with hydrogens summed into heavy atoms:
elementType: C C C C C C C C C O O
charge: 0.012506 0.311091 0.288934 -0.046105 -0.050307 0.113214 0.054831 0.050873 -0.083936 -0.334959 -0.316143
chargesum: 0.00000
1716.lowfreq: -16.2801 0.0004 0.0007 0.0008 9.4561 13.8846 53.6521 114.2935 159.2105
frequency: 53.3981 114.2910 159.2041 230.6319 279.6960 347.4677 375.6291 431.0159 438.0982 493.4454 530.8802 599.9439 681.6481 714.8057 748.7928 776.8068 846.8770 863.8900 880.0334 901.2293 917.0590 956.3484 969.4795 1030.6010 1063.8180 1078.9667 1117.9311 1137.1485 1179.0340 1206.0205 1217.3322 1243.6368 1267.0492 1292.9433 1301.1216 1330.5089 1348.4210 1361.5957 1367.8223 1382.3838 1414.8008 1422.6080 1468.7643 1483.9997 1688.3460 1749.5600 1810.1101 3053.3340 3063.2908 3072.6065 3103.1013 3110.5832 3114.2288 3122.0573 3122.6222 3177.3379 3197.6742
redmass: 5.2380 4.8889 2.0451 2.7216 2.5047 3.1190 5.3649 6.4107 5.6276 5.4231 3.7499 2.3434 4.9315 2.9471 2.0588 2.0551 2.4591 2.9455 2.5547 3.2106 2.4161 3.0843 2.0166 1.3660 1.7441 1.8491 1.6683 1.7559 1.4426 1.1320 1.5434 1.6787 1.3699 1.7768 1.4660 1.7325 1.6531 1.4566 1.5892 1.4301 1.2649 1.4938 1.0700 1.0974 7.1089 10.9139 11.8425 1.0652 1.0618 1.0638 1.1005 1.0896 1.0962 1.0908 1.0995 1.0868 1.0964
irintensity: 11.0169 5.2556 0.9776 0.8403 0.4739 1.5545 7.7264 22.7573 7.7689 7.3661 0.0958 2.0970 7.4618 9.0080 14.9271 24.8314 42.1434 10.3650 7.8671 1.4453 29.5744 5.7353 21.4885 2.7182 0.0653 6.1244 10.0316 24.8020 42.3355 21.9686 2.7905 26.1002 8.3472 25.3880 13.8425 39.5031 20.0218 7.0335 1.3536 2.7083 2.3892 53.8804 6.4436 10.4273 65.1623 518.7245 371.7057 6.5242 31.5561 38.3955 9.5682 17.9180 6.7605 24.9277 29.9256 2.9071 8.6832
temp: 298.150 k
press: 1.00000 atm
elementType: 6 6 6 6 1 6 6 1 1 6 6 6 8 8 1 1 1 1 1 1 1
symmnumber: 1
zpe: 457045.4 jmol-1
zpe.correction: 0.174079 hartree
zpe.thermalcorrener: 0.182968 hartree
zpe.thermalcorrenthalpy: 0.183913 hartree
zpe.thermalcorrgfe: 0.139830 hartree
zpe.sumelectzpe: -498.891201 hartree
zpe.sumelectthermal: -498.882312 hartree
zpe.sumelectthermalent: -498.881367 hartree
zpe.sumelectthermalfe: -498.925450 hartree
dipole: 1.6658 3.3762 2.3823
dipole: 4.4552
quadrupole: -83.8116 -62.9330 -59.2355
quadrupole: 3.0295 1.7437 -4.9775
quadrupole: -15.1515 5.7270 9.4245 3.0295 1.7437 -4.9775
hfenergy: -499.0652801 hartree
pointgroup: C01 [X(C9H10O2)]
dipole: 0.6216964 1.6373713 -0.0698823 debye
dipolederiv: -0.0178917 -0.0837149 -0.0042518 0.0696816 0.1634837 -0.0047672 -0.0649292 -0.091161 0.1342679 0.0001562 0.0868664 0.0890621 0.0630189 -0.2032532 -0.1128431 0.4850797 -0.1159599 -0.3052306 -0.0897597 -0.0680257 0.1288747 -0.1027182 -0.0037867 0.068944 0.1715587 0.0686997 -0.0887811 0.1094914 0.0033048 -0.0254858 0.0151031 0.0900251 -0.0513015 0.022161 0.0671184 0.030411 0.068477 0.0304107 -0.0004828 -0.0168513 -0.1017424 -0.0835429 -0.0404401 -0.112574 0.004495 0.558948 0.1825538 -0.0773549 0.2825307 -0.159949 -0.0473505 -0.2197369 -0.0764902 0.2516081 1.6244774 0.5867452 0.1721833 0.5698101 0.3849337 -0.0250112 0.4946083 0.0499843 1.1848182 -0.0426129 -0.0188769 -0.1158841 -0.0316598 0.0416832 -0.0262748 -0.0739429 -0.0150452 -0.0332983 -0.0901262 -0.0322276 -0.080957 0.0217459 0.0480425 0.0092301 -0.0697292 -0.0008867 0.0124942 -0.0512101 -0.0155749 -0.1735816 -0.0655082 0.0362133 -0.07046 -0.2717929 -0.0206254 -0.3072193 1.185892 -0.5706003 0.2987697 -0.8681821 0.9491906 0.4180969 0.1366146 0.3402338 0.8323622 -0.5112978 -0.0886637 -0.2035753 -0.0732648 -0.2244344 -0.0729307 -0.5515465 -0.1723794 -0.3984122 -1.5513133 -0.4510391 -0.1186503 -0.4361377 -0.5593901 -0.0212503 -0.1954983 -0.0325406 -0.7091912 -1.2160438 0.492357 -0.1093474 0.6571059 -0.8609739 -0.1037838 -0.1088781 -0.0490339 -0.5484326 0.0197132 -0.0538077 0.0764861 -0.0709335 0.1558062 0.0337302 0.040182 0.0248664 -0.0222919 0.062175 -0.0235571 -0.0058652 -0.0147019 0.1674383 0.0034439 -0.011366 -0.001462 -0.0658697 0.0469137 0.0032614 -0.0447967 0.0150167 -0.0850075 -0.0296682 0.0079472 0.0158275 0.117681 0.0632375 -0.0270921 0.0321811 -0.0327423 0.0213392 0.0841643 -0.0175628 0.0998354 -0.1188733 -0.0821232 -0.0389818 0.0654844 -0.0554695 0.0417229 0.0322559 0.1338999 0.0792636 -0.0279987 -0.0836744 0.0834013 0.0259165 0.0729008 -0.0117929 -0.0429351 0.0708956 -0.078083 0.0463906 -0.0034283 0.0032611 0.071275 0.0012558 0.1104516 0.042254 0.062476 0.0204121 0.0110709 unknown
polarizability: 153.2258132|8.5160845|117.3574369|6.2730134|2.7653459|128.3800029 unknown
InChI: InChI=1S/C9H10O2/c10-8-4-3-6-1-2-7(8)5-9(6)11/h3-4,6-7H,1-2,5H2
charge 0 multiplicity 1
21 atoms
C  0.85539484 1.77433275 -0.16940666
C  1.24506021 0.56199916 0.6904722
C  -0.83852071 0.07404626 -1.0698563
C  -0.43845586 1.55480525 -0.95777776
H  0.77152957 2.65061895 0.47485007
C  0.21167504 0.2076226 1.71505906
C  -1.63728379 -0.35462386 0.14149113
H  -1.51233519 -0.05497976 -1.91684834
H  2.19255329 0.75159757 1.19310495
C  0.38707051 -0.81182302 -1.2776288
C  1.44549812 -0.63784615 -0.22066676
C  -1.03959023 -0.19811381 1.47330223
O  -2.76438951 -0.79976874 0.02309679
O  2.39313506 -1.37719363 -0.11790843
H  -1.69244801 -0.45124796 2.30180458
H  0.53569077 0.26346663 2.74950075
H  0.12318789 -1.86944545 -1.34319336
H  -0.31609565 1.94758924 -1.9689572
H  1.68638983 1.96556407 -0.85259564
H  -1.26284551 2.11201057 -0.5087987
H  0.86253532 -0.55039805 -2.22970977
