program: Gaussian 16
title: Z
version: ES64L-G16RevC.01
frameworkgroup: C1[X(C9H9O2)]
method: RPBE1PBE
basis: def2TZVPP
operation: Freq
keyword: #N
keyword: Geom=AllCheck
keyword: Guess=TCheck
keyword: SCRF=Check
keyword: GenChk
keyword: RPBE1PBE/def2TZVPPFreq
converged: YES YES YES YES
title: Mulliken charges:
elementType: C C C C H C C H H C C C O O H H H H H H
charge: -0.202686 0.261268 0.312869 -0.200069 0.063792 -0.226641 0.122479 0.027032 0.022055 -0.611019 0.087033 -0.232336 -0.388375 -0.539762 0.102553 0.122537 0.063468 0.060158 0.081133 0.074510
chargesum: -1.00000
title: Mulliken charges with hydrogens summed into heavy atoms:
elementType: C C C C C C C C C O O
charge: -0.057761 0.283323 0.339901 -0.065401 -0.104104 0.122479 -0.547551 0.087033 -0.129783 -0.388375 -0.539762
1716.lowfreq: -23.4665 -5.7810 0.0006 0.0009 0.0010 21.7578 72.5974 143.9920 175.5089
frequency: 72.3806 143.9071 175.5049 251.8340 314.5958 352.6824 397.3000 423.9177 438.2404 502.4142 539.1464 578.5346 683.8702 706.4763 743.2012 758.6955 803.2499 851.4524 865.1069 905.2562 917.3916 941.4420 966.6660 1011.9690 1048.3958 1069.4324 1109.2248 1165.0959 1177.6389 1195.5568 1229.2924 1260.0694 1270.8688 1288.6335 1316.5428 1323.6611 1350.8104 1366.8923 1387.0076 1422.2986 1464.0516 1481.1938 1632.5683 1677.3046 1708.9891 3033.5419 3047.1957 3069.2630 3077.8674 3088.0528 3094.8904 3145.0995 3160.9263 3175.1638
redmass: 6.9360 5.6016 1.9543 3.4147 3.1975 2.8716 7.3644 6.0650 5.4053 4.1700 3.5631 1.4257 4.0997 2.9050 2.2499 4.4436 2.2829 2.7502 3.2866 3.0391 2.5270 3.2311 2.0807 1.3531 1.7663 1.7591 1.6697 1.3729 1.5956 1.1508 1.6166 1.3493 1.7751 1.6346 1.5453 1.6994 1.4974 1.5589 2.8068 2.0514 1.0738 1.1089 8.2836 7.2957 10.0033 1.0620 1.0633 1.0935 1.0936 1.0859 1.1014 1.0862 1.0891 1.0950
irintensity: 6.7018 0.9052 0.7282 18.5014 11.3420 3.4227 0.1440 20.8253 9.5606 63.2495 5.6691 46.3317 20.0150 19.5068 19.5913 22.4291 4.5096 25.4638 13.7367 8.4946 50.8782 18.7962 18.2923 5.4156 5.4848 13.2281 1.7694 17.7344 17.7146 13.1555 17.4537 6.3552 29.3910 24.1923 14.8881 30.5458 3.1664 24.8836 96.5308 32.4675 10.2539 8.6232 948.3930 7.7404 626.3908 50.0666 113.7361 31.3610 55.7593 61.8466 80.4400 28.2146 66.7885 35.7213
temp: 298.150 k
press: 1.00000 atm
elementType: 6 6 6 6 1 6 6 1 1 6 6 6 8 8 1 1 1 1 1 1
symmnumber: 1
zpe: 419786.2 jmol-1
zpe.correction: 0.159888 hartree
zpe.thermalcorrener: 0.168580 hartree
zpe.thermalcorrenthalpy: 0.169525 hartree
zpe.thermalcorrgfe: 0.126231 hartree
zpe.sumelectzpe: -498.383089 hartree
zpe.sumelectthermal: -498.374397 hartree
zpe.sumelectthermalent: -498.373452 hartree
zpe.sumelectthermalfe: -498.416746 hartree
dipole: -2.0366 6.9846 2.6305
dipole: 7.7364
quadrupole: -99.0424 -77.2983 -67.3919
quadrupole: 6.5198 2.2993 -1.7092
quadrupole: -17.7982 3.9459 13.8523 6.5198 2.2993 -1.7092
hfenergy: -498.5429771 hartree
pointgroup: C01 [X(C9H9O2)]
dipole: -0.9111251 2.7311101 0.9875277 debye
dipolederiv: 0.0318978 -0.1017988 -0.0484336 0.0410637 0.294631 0.0454148 -0.1603671 -0.0216853 0.1880668 0.1064296 0.1101 0.1922047 0.0344149 -0.222593 -0.0880117 0.5952371 -0.1295439 -0.2999981 0.0350902 -0.1051099 0.0828579 0.189922 0.0460324 -0.174454 0.2258569 0.0439593 0.1340196 0.1021561 -0.0182564 -0.0806163 -0.0520325 0.0743903 -0.0283428 -0.1090819 0.0619343 0.1328465 0.0724245 0.0360345 0.0082737 -0.0507764 -0.1993562 -0.1231531 -0.0329784 -0.1663649 -0.0279818 0.5626402 0.1990691 -0.1975824 0.2902987 -0.1718858 -0.0735744 -0.1261401 -0.0991148 0.1979436 1.9136628 0.5802793 -0.0328694 0.7020102 0.3938832 0.0601183 0.3871523 0.0599004 1.0461021 -0.0816238 -0.0235273 -0.1554505 -0.0502318 0.0302852 -0.0412008 -0.132547 -0.012833 -0.1008771 -0.1738665 -0.062513 -0.1307447 0.0096085 0.0450042 0.0039377 -0.09104 -0.0005039 -0.0243872 -0.9989138 0.0332798 0.0413 -0.2558983 -0.2854934 0.2922349 -0.3666469 0.3739861 -0.9844414 1.9791221 -0.7651109 0.6865339 -1.0576701 0.6796605 0.2031523 0.6023306 0.1624307 0.6829045 -0.4263088 -0.1085372 -0.2050661 -0.0925197 -0.2151686 0.0078934 -0.6119499 -0.147665 -0.2656169 -1.9045076 -0.4580434 0.0040766 -0.770047 -0.5886201 0.0616391 -0.2309958 -0.0248764 -0.6672024 -2.102079 0.6699465 -0.3601863 1.0857865 -1.0142429 0.0470798 -0.2363444 -0.0152571 -0.616644 -0.0144176 -0.0637071 0.1219596 -0.0965644 0.136666 0.0249946 0.0855731 0.0305651 -0.0663495 0.0756199 -0.0340594 -0.0179029 -0.0132494 0.1494104 -0.0433526 -0.048099 -0.03308 -0.1752876 0.0075932 0.0797367 -0.0657727 0.0256433 -0.1056372 -0.2511714 0.0201841 -0.21119 0.0417358 0.0713523 -0.0277892 0.0301119 0.0079399 -0.004553 0.0844105 -0.0341362 0.1504264 -0.1642993 -0.1143727 -0.0674099 0.0799402 -0.0473357 0.0127667 0.022255 0.1558808 0.0922922 -0.0534381 -0.141899 0.1274166 0.0473664 0.0996377 -0.0551795 -0.0298695 0.1081118 -0.1133801 0.0229045 unknown
polarizability: 181.9906922|5.4959962|129.9447147|4.4412521|6.896476|148.2380833 unknown
InChI: InChI=1S/C9H9O2/c10-8-4-3-6-1-2-7(8)5-9(6)11/h3-7H,1-2H2
charge -1 multiplicity 1
20 atoms
C  0.86697538 1.77989157 -0.14676356
C  1.23453677 0.52560488 0.6662618
C  -0.81500612 0.10501374 -1.08653309
C  -0.43470492 1.58911089 -0.92740326
H  0.79346641 2.64843959 0.51433305
C  0.19874353 0.23091566 1.69617133
C  -1.61048259 -0.39537108 0.09297943
H  -1.47078775 -0.00930945 -1.95244778
H  2.19633743 0.68433098 1.15629417
C  0.39224874 -0.79089858 -1.21605388
C  1.42947253 -0.66068182 -0.31692044
C  -1.04358768 -0.19888966 1.43987165
O  -2.69174425 -0.95758496 -0.0373384
O  2.48151141 -1.33973946 -0.20070345
H  -1.71784396 -0.43351728 2.25841608
H  0.485378 0.35806733 2.73764596
H  0.33887979 -1.65158278 -1.87580786
H  -0.32662651 2.01960813 -1.92597471
H  1.69459698 1.97493728 -0.83286397
H  -1.25663418 2.12761719 -0.4449751
