program: Gaussian 16
title: DD
version: ES64L-G16RevC.01
frameworkgroup: C1[X(C9H9O2)]
method: RPBE1PBE
basis: def2TZVPP
operation: Freq
keyword: #N
keyword: Geom=AllCheck
keyword: Guess=TCheck
keyword: SCRF=Check
keyword: GenChk
keyword: RPBE1PBE/def2TZVPPFreq
converged: YES YES NO NO
title: Mulliken charges:
elementType: C C C C C C C C C O H O H H H H H H H H
charge: -0.238978 -0.155753 0.313955 0.277263 0.066314 -0.614918 0.093701 -0.232155 -0.190496 -0.375836 0.057114 -0.555042 0.069052 -0.006258 0.063708 0.117810 0.105059 0.059967 0.079791 0.065702
chargesum: -1.00000
title: Mulliken charges with hydrogens summed into heavy atoms:
elementType: C C C C C C C C C O O
charge: -0.090134 -0.026343 0.307696 0.334377 0.066314 -0.554951 0.093701 -0.127096 -0.072686 -0.375836 -0.555042
1716.lowfreq: -36.8922 -20.7420 -0.0011 -0.0005 0.0004 21.6125 44.1934 145.9761 160.3724
frequency: 44.1480 145.7944 160.2267 264.7407 315.4456 327.0747 398.2739 426.8576 472.6695 513.5264 529.2065 549.2217 675.7518 713.3617 739.7804 775.1588 816.8111 843.7276 872.8152 894.5200 907.9101 926.4379 979.5357 1017.7516 1030.1167 1078.8025 1106.1668 1160.6197 1181.8537 1204.9725 1224.1071 1242.2838 1265.6036 1293.0964 1306.1685 1344.4391 1353.1032 1357.9631 1383.7658 1420.1865 1468.3242 1485.5427 1640.8623 1679.3338 1714.0846 3032.2072 3048.4706 3068.5495 3078.4947 3098.1769 3104.0250 3134.9521 3164.1224 3176.2993
redmass: 4.1856 7.6100 2.1101 3.0519 3.6631 3.0893 6.8119 5.2374 4.9420 1.9057 2.9356 3.3324 6.8743 3.6871 2.8830 1.7322 3.0514 2.2936 3.5857 2.4235 3.4301 2.9143 2.2748 1.6453 1.5838 1.6976 2.1187 1.3318 1.4205 1.1613 1.6083 1.3515 1.5704 1.5723 1.6004 1.7417 1.5339 1.4674 2.5187 2.1582 1.0732 1.1072 8.3437 7.0855 10.2201 1.0630 1.0646 1.0862 1.0987 1.0979 1.0892 1.0874 1.0895 1.0943
irintensity: 7.1975 0.8177 1.1740 7.3917 11.4421 2.9156 10.6604 23.6728 15.9397 44.5579 49.4240 18.4168 1.8742 24.9431 4.9203 25.2473 2.6602 48.6205 16.2738 4.7435 31.3624 20.9762 8.7012 12.4983 10.1282 28.1608 8.6699 41.5377 11.3990 10.2235 26.6708 8.4250 40.8404 31.9000 27.0250 11.5550 8.3940 12.0754 128.9092 33.3003 6.9912 9.7374 801.1937 4.2499 638.3969 56.8894 118.5944 70.1579 11.2989 71.3995 59.5474 38.8471 76.2817 29.7097
temp: 298.150 k
press: 1.00000 atm
elementType: 6 6 6 6 6 6 6 6 6 8 1 8 1 1 1 1 1 1 1 1
symmnumber: 1
zpe: 419634.7 jmol-1
zpe.correction: 0.159830 hartree
zpe.thermalcorrener: 0.168597 hartree
zpe.thermalcorrenthalpy: 0.169541 hartree
zpe.thermalcorrgfe: 0.125737 hartree
zpe.sumelectzpe: -498.378561 hartree
zpe.sumelectthermal: -498.369795 hartree
zpe.sumelectthermalent: -498.368851 hartree
zpe.sumelectthermalfe: -498.412655 hartree
dipole: 3.6762 -8.3763 2.5022
dipole: 9.4836
quadrupole: -83.4600 -88.3154 -69.0278
quadrupole: -2.7418 0.6775 7.3375
quadrupole: -3.1923 -8.0477 11.2400 -2.7418 0.6775 7.3375
hfenergy: -498.5383917 hartree
pointgroup: C01 [X(C9H9O2)]
dipole: 2.2009322 -2.8558967 0.9597502 debye
dipolederiv: 0.142418 0.0862318 0.0714991 -0.0282552 0.1513552 -0.1156303 -0.022483 -0.032478 0.1790471 -0.0238771 0.0056787 0.0017388 -0.0338456 0.180242 -0.0399955 0.1776411 0.0209535 0.080408 -0.1039354 -0.4327245 -0.0094269 -0.3842095 -0.5645947 0.154845 -0.1206599 0.1001351 -0.12208 0.3183291 0.0059538 0.015432 -0.0789579 0.1508906 -0.0352854 -0.1950575 0.0679469 0.1313263 1.5511408 -0.7928545 -0.3985821 -0.9899267 1.6132675 -0.2417099 -0.3712827 -0.5648978 0.279322 -1.2248822 0.3187604 -0.0785003 -0.0204172 -0.3938832 -0.2800685 0.0277265 -0.4374684 -0.5976444 1.9767707 0.3650968 -0.2456041 0.145931 0.8365534 0.4413823 -0.2855584 0.4890304 0.4630263 -0.6843429 -0.0109837 0.1551568 0.3674966 -0.2281439 -0.0477928 0.3767571 0.0990457 -0.2839008 0.4829205 0.1455892 -0.0721671 0.3169048 0.2276996 0.2250413 -0.0046672 0.1873112 -0.023983 -1.861617 -0.3952075 0.1487699 -0.2603465 -0.6448257 -0.1112737 0.1527677 -0.125826 -0.5091935 -0.2173734 0.0326903 0.0992094 0.0156197 0.0484637 -0.0237316 0.1233433 -0.0342946 0.0006995 -1.2560734 0.7621731 0.0768345 0.9794981 -1.8599826 0.115952 -0.073334 0.3738214 -0.5918734 0.0059373 -0.0479999 0.0707081 -0.0742215 -0.0805703 0.1911139 0.0571151 0.1028384 -0.0822054 -0.1193569 0.0790807 0.0862374 0.0854234 0.0069597 -0.0656545 0.0370006 -0.0311437 -0.0075568 -0.1151048 -0.0643696 -0.068566 -0.1555039 -0.0149488 -0.0787492 -0.1145266 -0.0734832 0.0026932 0.0321179 0.0542573 0.070767 0.0608248 -0.0268353 -0.1418242 0.0969745 -0.185476 0.0427963 0.0057758 -0.1153023 -0.0320937 -0.0766498 -0.0196012 -0.1254617 -0.0180509 -0.1447119 0.0945952 0.0437339 -0.0258747 0.1582078 -0.0437047 -0.0931229 0.2084673 0.215544 0.1880803 0.0214807 0.032714 -0.0335179 -0.0383044 0.0121522 -0.0598078 -0.1557405 -0.0200048 -0.1091202 -0.0774369 0.0147052 0.0633225 -0.0113162 0.1621876 -0.2291154 0.126116 -0.0392449 0.109737 0.0004796 unknown
polarizability: 174.5715652|-1.2649889|146.983224|-11.1492528|4.5962792|127.7740729 unknown
InChI: InChI=1S/C9H9O2/c10-8-4-2-6-1-3-7(8)9(11)5-6/h2,4-7H,1,3H2
charge -1 multiplicity 1
20 atoms
C  0.35754931 -0.02236763 1.75432608
C  1.70889714 -0.41417053 1.14607507
C  -0.6928729 0.4219431 0.71467804
C  1.68700857 -0.26595364 -0.39050446
C  -0.08745946 1.46484624 -0.26898487
C  1.1332548 1.08376091 -0.77059188
C  -1.28513999 -0.76080637 0.00435016
C  -0.40443131 -1.6282574 -0.78815245
C  0.90371498 -1.41088663 -0.97226221
O  -2.47963365 -1.01980712 0.08473052
H  2.71318611 -0.35395157 -0.75403217
O  -0.75689462 2.51426396 -0.47166577
H  -0.04989365 -0.8411756 2.35506035
H  -1.52063978 0.91578334 1.22406746
H  2.4958252 0.2420117 1.524691
H  1.45036387 -2.12504969 -1.58610366
H  -0.89394134 -2.47640529 -1.25712103
H  1.66510876 1.69701742 -1.49114136
H  0.49247547 0.81920158 2.43734393
H  1.97904882 -1.43669651 1.4284039
