program: Gaussian 16
title: O-n
version: ES64L-G16RevC.01
frameworkgroup: C1[X(C9H12O)]
method: RPBE1PBE
basis: def2TZVPP
operation: Freq
keyword: #N
keyword: Geom=AllCheck
keyword: Guess=TCheck
keyword: SCRF=Check
keyword: GenChk
keyword: RPBE1PBE/def2TZVPP
keyword: Freq
converged: YES YES YES YES
title: Mulliken charges:
elementType: C C C C C C C C C O H H H H H H H H H H H H
charge: -0.269305 -0.219023 -0.101175 0.156244 -0.161975 -0.108864 0.064671 0.150629 -0.213127 -0.326534 0.117551 0.079547 0.068980 0.050936 0.079482 0.115123 0.089381 0.096724 0.076967 0.080119 0.082285 0.091364
chargesum: 0.00000
title: Mulliken charges with hydrogens summed into heavy atoms:
elementType: C C C C C C C C C O
charge: -0.151754 -0.103899 0.079570 0.225224 -0.005462 0.067342 0.064671 0.201566 -0.050724 -0.326534
1716.lowfreq: -26.8949 -13.9398 -0.0005 0.0004 0.0010 21.5108 73.5526 189.9523 220.0128
frequency: 73.4907 189.9478 220.0052 267.9985 351.0157 385.2648 421.8891 493.9883 495.4316 568.3226 603.0317 710.5666 717.4268 761.5531 796.6478 830.2520 880.3155 913.2955 929.6616 950.4917 997.8087 1004.0508 1016.2916 1031.9435 1059.3898 1087.6635 1105.2925 1129.7047 1149.2629 1166.9248 1202.2925 1239.9615 1264.8850 1287.5305 1307.5478 1336.5988 1341.3110 1350.4948 1366.4333 1374.9730 1384.8602 1422.5923 1435.1637 1447.4100 1471.0827 1481.2215 1728.5716 1788.5739 3031.6082 3041.7938 3046.9515 3047.9471 3062.1851 3067.5095 3094.4496 3095.9678 3096.8677 3123.3207 3154.9683 3177.2461
redmass: 4.8216 2.4717 2.9256 2.0858 3.2178 2.1364 3.0653 2.5903 3.2854 2.7475 4.4221 2.1247 2.9165 2.2274 1.9482 2.5135 2.9538 2.2533 1.7087 2.0648 2.5125 1.3908 1.7578 2.3972 1.6167 1.5106 1.5679 1.7220 1.1179 1.1767 1.1297 1.3707 1.5266 1.5946 1.7111 1.6505 1.6405 1.3935 1.6313 1.7088 1.6266 1.6975 1.0902 1.0874 1.0982 1.0998 6.8170 11.2293 1.0623 1.0669 1.0627 1.0607 1.0998 1.0820 1.1039 1.1031 1.0868 1.0965 1.0846 1.0979
irintensity: 7.0957 1.6212 0.1985 0.2639 2.1635 1.3862 6.3017 6.9563 17.3341 6.1997 7.1440 36.8488 18.0041 8.9194 4.4424 4.7665 10.0636 6.6851 1.5811 11.7201 6.9361 9.4742 18.2815 3.1076 6.3788 1.2592 0.0312 34.1920 1.2235 17.2587 7.0264 1.3530 22.8822 3.5506 1.3955 8.4698 11.9147 2.6225 14.3634 4.6060 1.2862 1.6934 27.1776 17.9768 15.9127 4.9913 8.3258 382.7154 35.0043 9.5149 41.4403 36.6644 20.1399 81.8479 40.6510 57.7459 23.4359 26.8256 10.8798 39.1094
temp: 298.150 k
press: 1.00000 atm
elementType: 6 6 6 6 6 6 6 6 6 8 1 1 1 1 1 1 1 1 1 1 1 1
symmnumber: 1
zpe: 505908.2 jmol-1
zpe.correction: 0.192690 hartree
zpe.thermalcorrener: 0.200735 hartree
zpe.thermalcorrenthalpy: 0.201679 hartree
zpe.thermalcorrgfe: 0.160057 hartree
zpe.sumelectzpe: -424.898259 hartree
zpe.sumelectthermal: -424.890214 hartree
zpe.sumelectthermalent: -424.889270 hartree
zpe.sumelectthermalfe: -424.930892 hartree
dipole: 3.6291 0.8329 0.2179
dipole: 3.7298
quadrupole: -73.0357 -55.9140 -58.0080
quadrupole: -1.9255 -1.0497 0.3765
quadrupole: -10.7165 6.4053 4.3113 -1.9255 -1.0497 0.3765
hfenergy: -425.0909489 hartree
pointgroup: C01 [X(C9H12O1)]
dipole: -1.4390747 0.2870111 0.0005783 debye
dipolederiv: -0.1616613 -0.1441111 0.0339886 -0.2233501 -0.026617 0.2067284 0.052574 0.1945272 0.0306138 0.0031032 -0.1899983 0.2005273 -0.1898965 -0.0498039 -0.0183837 0.2045968 0.0360798 -0.021355 0.1029474 0.0599413 -0.0873777 0.0006192 0.0826106 0.0777956 -0.1026474 -0.0115796 0.0460702 0.1002083 0.0836696 0.0684049 0.096994 0.0892082 0.0299902 -0.0207326 -0.0450916 0.023282 0.2019054 -0.0526429 0.0347572 -0.0516637 0.0872539 -0.0687006 0.0189015 0.0368972 0.1553614 -0.127512 0.0886114 -0.0931117 0.1912005 -0.18529 0.2422172 -0.1537192 0.2151497 -0.1092144 1.6137338 -0.3345839 -0.1638682 -0.3200081 0.5628268 -0.5213171 -0.2323353 -0.4671972 0.7280533 -0.2031388 -0.0698518 0.1291247 -0.11887 0.0410784 0.0546965 0.2478806 0.0270138 -0.1386201 0.1359657 0.0243128 -0.0624984 0.0132921 0.1272903 0.0200376 0.0072552 0.0397999 0.0228865 -1.5154135 0.2547683 0.0467957 0.2752602 -0.5582914 0.1611018 0.0627704 0.1397312 -0.5733934 0.0025868 0.1495489 -0.073362 0.1638894 -0.0093298 -0.0129542 -0.0678778 -0.0176202 0.0691249 0.0259645 0.0303591 0.0759226 0.0023693 -0.0614113 -0.1645397 0.0033172 -0.1217903 -0.1048689 -0.1442013 -0.0631873 -0.0987191 -0.0585973 0.0303557 -0.0677892 -0.0894105 -0.0276567 -0.007284 -0.0433279 0.1131384 -0.0709655 0.0760315 -0.0593191 0.0760185 -0.0364195 0.0629233 0.0042019 -0.0847881 -0.0525023 0.1200892 -0.0102228 0.0941107 0.0176654 0.0753992 0.0620163 -0.0303773 0.0788342 0.1060633 0.0076455 0.1023324 -0.0260535 -0.1476542 -0.0040734 -0.1169229 0.0142695 -0.0928635 -0.0672103 -0.1263064 -0.0699746 -0.0111458 -0.0470188 -0.0234521 -0.0460534 0.0789003 0.1172076 0.02671 -0.0302905 0.0072366 -0.0011944 -0.0780662 -0.0681826 -0.0826488 0.0129907 -0.0123436 0.0681476 -0.0906024 0.0690928 -0.0767113 0.1501376 -0.0482727 0.1053745 -0.0149695 0.0469191 0.0749668 0.0376962 0.0337482 -0.0904099 -0.1233572 0.014714 -0.1593104 -0.0411271 -0.0670881 -0.0966665 0.0906175 -0.0576504 0.0173691 0.0728858 0.0984649 0.1097727 -0.0472583 0.0229617 -0.009483 0.0515326 0.0681672 0.0234738 0.1405063 0.0612491 0.0665857 -0.0972865 unknown
polarizability: 135.7423167|-5.7053304|119.3971949|6.7900399|0.2111316|141.1946657 unknown
InChI: InChI=1S/C9H12O/c10-9-5-4-7-2-1-3-8(9)6-7/h1-2,7-8H,3-6H2
charge 0 multiplicity 1
22 atoms
C  -1.63574374 1.15061958 0.20176066
C  -0.97374426 1.31356883 1.34337004
C  0.1487336 0.42760129 1.77942481
C  -1.30523327 0.05239961 -0.76531742
C  -0.34480616 0.55030758 -1.85110434
C  0.99597938 0.97890518 -1.25624882
C  1.55330477 -0.0080753 -0.26511208
C  0.5735894 -0.60457501 0.72253854
C  -0.65855875 -1.11263007 -0.02670676
O  2.7287176 -0.30445543 -0.24746081
H  -2.4270678 1.84354122 -0.06966335
H  -0.1845405 -0.2569443 -2.57231979
H  -2.2250452 -0.28595441 -1.250281
H  1.09773523 -1.4229688 1.2181422
H  1.7455362 1.16112812 -2.02684589
H  -1.24319319 2.12444288 2.01436515
H  1.00644457 1.03930061 2.08008491
H  0.85721526 1.91602426 -0.70372739
H  -0.78320166 1.38798054 -2.39917537
H  -0.37528253 -1.89721524 -0.73392927
H  -1.36132 -1.55116876 0.68681707
H  -0.15128455 -0.11041348 2.68629631
