program: Gaussian 16
title: Title Card Required
version: ES64L-G16RevC.01
frameworkgroup: C1[X(C13H15O2)]
method: RPBE1PBE
basis: def2SVP
operation: Freq
keyword: #P
keyword: Geom=AllCheck
keyword: Guess=TCheck
keyword: SCRF=Check
keyword: GenChk
keyword: RPBE1PBE/def2SVP
keyword: Freq
converged: YES YES NO YES
title: Mulliken charges:
elementType: C C C C C C C C C O O H C C C C H H H H H H H H H H H H H H
charge: -0.368121 0.260777 0.263026 -0.295801 -0.298302 -0.014940 -0.170859 -0.103284 -0.186961 -0.288863 -0.287633 0.028831 0.038685 -0.026026 0.059821 0.060313 -0.042074 -0.035633 0.031251 0.031577 0.023940 0.026506 0.045103 0.030764 0.034784 0.043588 0.030616 0.034612 0.043725 0.030577
chargesum: -1.00000
title: Mulliken charges with hydrogens summed into heavy atoms:
elementType: C C C C C C C C C O O C C C C
charge: -0.368121 0.260777 0.263026 -0.295801 -0.298302 0.013891 -0.212933 -0.103284 -0.222594 -0.288863 -0.287633 0.125454 0.076346 0.168808 0.169227
polarizability: 2.14868026e+02 4.68849990e+00 2.08129129e+02 -4.96006823e-01 1.32232591e+00 1.64409247e+02
1716.lowfreq: -20.7836 -5.6309 -0.0007 -0.0003 0.0005 33.4716 74.6837 96.0369 100.7444
frequency: 74.6642 95.9975 100.5729 121.1537 140.2245 149.3956 204.4570 208.9750 215.3190 231.6013 242.8450 264.1282 278.3126 296.0704 306.5066 341.0534 425.5065 448.0450 466.8162 485.7470 509.9693 540.3110 545.8233 587.3289 612.0130 640.8412 725.3540 729.3130 774.6058 800.7881 839.4572 855.6874 882.9727 927.8081 979.5448 981.8742 1006.9261 1014.0083 1033.1975 1048.0182 1072.6232 1086.3543 1138.1420 1148.3675 1169.2776 1181.0822 1207.0869 1223.5198 1279.7536 1315.7439 1351.4420 1356.0582 1366.3743 1372.8840 1385.1388 1408.8712 1431.5572 1434.2282 1437.0245 1445.8128 1448.3114 1449.4906 1450.0302 1452.0318 1463.2741 1535.4092 1582.1314 1782.2968 1822.6467 3034.0984 3045.1028 3047.8105 3053.2758 3114.2407 3131.4400 3133.1343 3137.3149 3140.0210 3147.7460 3153.0534 3156.6787 3160.8833 3163.5983 3185.6565
redmass: 1.1543 6.3149 2.2717 8.1694 1.0678 1.1425 1.9757 1.2475 2.3003 2.3394 2.5822 2.8298 3.7320 5.2887 3.2053 4.6203 4.7205 2.7577 1.6277 4.3187 4.2390 3.8553 2.2615 2.0103 6.9673 3.0975 4.4219 3.3175 3.7283 4.1086 4.4155 2.2392 2.4586 2.2790 1.2737 1.6131 2.2520 2.4564 1.5222 1.8630 1.6865 1.6515 2.6380 2.0177 1.9140 3.1960 1.8770 4.5188 1.7106 1.8939 1.6924 1.5339 1.5622 1.5463 1.3341 2.6658 1.0774 1.0629 1.2054 1.0909 1.1540 1.1486 1.0597 1.1751 1.7441 4.4896 6.6840 12.6538 12.6304 1.0391 1.0379 1.0381 1.0359 1.1012 1.1029 1.1031 1.1032 1.0879 1.1039 1.1039 1.1029 1.1048 1.0886 1.0907
irintensity: 0.8773 1.1964 0.6352 7.4574 0.4206 0.6398 2.8498 1.1127 9.7936 2.2716 2.3752 14.0287 5.4731 5.3169 4.4488 9.3928 11.6717 1.1824 3.2390 2.2572 3.6484 29.1411 7.2099 59.7060 2.1528 1.2712 6.4692 87.1242 6.4075 63.1746 15.4381 14.5605 5.6797 14.5052 0.1911 30.1233 11.2461 1.0742 15.9622 20.1858 2.2855 7.5914 24.7795 12.3224 5.1197 1.8849 15.4299 67.6718 13.1797 4.3710 52.0126 0.6425 1.2733 1.4768 5.1098 9.8101 31.0178 6.5359 23.9861 8.3441 22.3053 33.3241 8.3751 15.5488 14.9285 50.1402 471.1294 837.7933 352.8328 77.7949 32.5747 91.1744 52.0276 30.8707 8.1752 38.9051 48.6697 18.1478 24.5041 20.8964 19.0894 15.7931 32.2042 36.2903
temp: 298.150 k
press: 1.00000 atm
elementType: 6 6 6 6 6 6 6 6 6 8 8 1 6 6 6 6 1 1 1 1 1 1 1 1 1 1 1 1 1 1
symmnumber: 1
zpe: 644393.9 jmol-1
zpe.correction: 0.245437 hartree
zpe.thermalcorrener: 0.260522 hartree
zpe.thermalcorrenthalpy: 0.261466 hartree
zpe.thermalcorrgfe: 0.204980 hartree
zpe.sumelectzpe: -653.487525 hartree
zpe.sumelectthermal: -653.472440 hartree
zpe.sumelectthermalent: -653.471496 hartree
zpe.sumelectthermalfe: -653.527982 hartree
dipole: -3.7732 -1.8015 0.1597
dipole: 4.1843
quadrupole: -96.3457 -99.6998 -115.6557
quadrupole: 4.4102 -0.0178 0.4731
quadrupole: 7.5547 4.2006 -11.7553 4.4102 -0.0178 0.4731
hfenergy: -653.732962 hartree
pointgroup: C01 [X(C13H15O2)]
dipole: -1.497573 -0.6760344 0.1013913 debye
polarizability: 215.041889|4.5238708|207.9688111|-0.7652429|-1.0647761|164.395703 unknown
InChI: InChI=1S/C13H15O2/c1-7-5-8-12(3)9(14)11(2,6-7)10(15)13(8,12)4/h5-6,8H,1-4H3
charge -1 multiplicity 1
30 atoms
C  0.40201367 1.19204318 -0.0765
C  -0.35504774 0.69606854 1.15033161
C  -0.41901431 0.66391619 -1.24782651
C  -1.21349118 -0.45011513 0.75670462
C  -1.25156186 -0.47313607 -0.77927026
C  -0.48826232 -1.57317893 -0.01406373
C  0.93951287 -1.86151533 -0.04257734
C  1.94083975 -0.88975576 -0.07070812
C  1.74464577 0.4913295 -0.10081806
O  -0.30542481 1.17086541 2.27290228
O  -0.43806848 1.11393394 -2.38120609
H  -1.10894377 -2.47756755 0.01230528
C  0.55393966 2.69891687 -0.10005821
C  3.37493141 -1.37107849 -0.02431272
C  -2.39245465 -0.76603748 1.62986719
C  -2.47235917 -0.81393028 -1.58294854
H  1.22185892 -2.91740695 -0.01822994
H  2.61883053 1.15087603 -0.11678119
H  1.0938931 3.00789832 -1.00750067
H  1.11861308 3.03108904 0.78383197
H  -0.42354303 3.20662496 -0.09357724
H  3.46995728 -2.39751266 -0.4124373
H  3.76683721 -1.3730251 1.00801416
H  4.04061164 -0.72487127 -0.61913427
H  -3.07952537 0.09229292 1.71548267
H  -2.05243345 -1.01695467 2.64707305
H  -2.96300443 -1.62411404 1.24488678
H  -3.16496893 0.04100185 -1.65663454
H  -2.18314533 -1.09123139 -2.60899276
H  -3.0204311 -1.66213766 -1.14684711
