program: Gaussian 16
title: Title Card Required
version: ES64L-G16RevC.01
frameworkgroup: C1[X(C13H15O2)]
method: RPBE1PBE
basis: def2SVP
operation: Freq
keyword: #P
keyword: Geom=AllCheck
keyword: Guess=TCheck
keyword: SCRF=Check
keyword: GenChk
keyword: RPBE1PBE/def2SVPFreq
converged: YES YES YES YES
title: Mulliken charges:
elementType: C O H C C C C C C C C O C C C C H H H H H H H H H H H H H H
charge: 0.254662 -0.280684 0.024114 -0.279950 0.237697 -0.375643 -0.086267 -0.219621 0.015717 -0.021512 -0.328412 -0.444428 0.063634 0.068269 0.037420 0.006671 0.009823 0.018631 0.029831 0.025941 0.018020 0.030102 0.032468 0.015030 0.046957 0.041569 0.037033 0.004638 0.010568 0.007720
chargesum: -1.00000
title: Mulliken charges with hydrogens summed into heavy atoms:
elementType: C O C C C C C C C C O C C C C
charge: 0.254662 -0.280684 -0.279950 0.237697 -0.375643 -0.062154 -0.219621 0.025541 -0.002882 -0.328412 -0.444428 0.137427 0.145869 0.162980 0.029597
polarizability: 2.22782526e+02 1.93836787e+00 1.78057222e+02 -8.18005870e-01 -3.43867898e+00 1.61000607e+02
1716.lowfreq: -0.0004 -0.0001 0.0006 8.8226 14.3496 31.6211 96.1131 111.4397 127.6059
frequency: 95.8992 111.1567 127.4402 148.1637 161.7686 176.7884 185.8668 242.0087 249.3415 285.5491 297.1637 307.2443 324.9268 354.6651 359.4211 364.4904 419.2440 436.1148 454.4699 489.6021 532.0375 588.1008 610.1097 637.1590 664.1682 677.4009 726.9899 781.9935 801.6034 840.8376 846.7067 898.0858 923.3775 938.3081 962.8216 978.2115 988.1576 1020.5643 1042.8147 1064.3806 1087.9711 1093.7664 1107.4724 1160.2249 1181.5780 1195.1441 1205.0599 1258.5596 1270.2244 1281.4226 1330.8111 1336.8468 1376.4810 1379.1028 1389.2146 1405.4467 1419.0819 1429.8209 1433.5997 1441.2555 1443.4140 1448.5004 1449.6447 1452.1780 1472.0151 1475.1230 1656.0497 1714.0856 1815.0015 2956.2391 3026.4579 3049.2524 3056.7975 3065.6164 3127.0588 3129.5643 3148.3133 3150.6907 3160.9950 3162.8009 3169.0944 3178.8350 3181.3348 3186.4145
redmass: 3.4649 5.7584 1.4156 2.6943 1.1486 1.3326 1.7175 1.3059 1.6768 2.6144 2.3639 2.5515 4.1967 2.8311 3.2960 3.5587 3.5205 5.9678 5.4609 4.0644 5.2809 4.7206 3.2623 4.0933 4.6297 2.5616 4.2277 2.0988 5.3975 2.5522 2.8308 2.1931 1.7346 1.5726 1.3794 1.4747 1.4741 2.0007 1.4529 1.6643 1.6291 2.0148 1.5286 2.9763 1.9559 2.5172 2.5103 4.0985 2.0471 2.7952 3.5886 1.5322 1.4410 1.4029 1.3484 2.1788 2.0738 1.1290 1.2443 1.1042 1.0788 1.0523 1.1134 1.0900 1.3127 2.8920 9.7151 7.8703 12.1778 1.0529 1.0883 1.0398 1.0373 1.0378 1.0960 1.1038 1.1034 1.1020 1.1040 1.0856 1.1035 1.0964 1.0968 1.1007
irintensity: 0.1613 6.6382 1.1151 4.4935 0.3795 1.8068 1.8530 1.8931 3.3840 5.5079 5.1061 3.9588 13.8829 10.2449 24.0390 25.8695 3.5048 8.5005 0.8894 21.7524 29.0350 13.7248 5.5711 2.5898 23.9660 37.9819 10.0828 47.2806 3.2991 14.1171 12.2183 5.9847 9.9290 15.6809 5.4546 4.1252 8.1361 31.2402 3.7897 36.7813 16.5284 17.1655 9.7890 48.0436 6.0830 3.4204 6.4990 1.6317 6.4975 2.6978 75.3106 59.9393 2.9080 8.5805 5.0852 7.2025 30.9436 14.2696 55.7774 6.6206 3.8356 2.6801 23.1810 5.9479 31.3822 37.1280 599.9648 40.2130 466.2400 232.1077 88.2718 49.5883 52.2421 50.5583 12.8954 26.7073 31.9518 30.3737 24.8829 10.3715 11.9766 0.2435 53.9836 32.7234
temp: 298.150 k
press: 1.00000 atm
elementType: 6 8 1 6 6 6 6 6 6 6 6 8 6 6 6 6 1 1 1 1 1 1 1 1 1 1 1 1 1 1
symmnumber: 1
zpe: 649415.0 jmol-1
zpe.correction: 0.247349 hartree
zpe.thermalcorrener: 0.261511 hartree
zpe.thermalcorrenthalpy: 0.262456 hartree
zpe.thermalcorrgfe: 0.208387 hartree
zpe.sumelectzpe: -653.490104 hartree
zpe.sumelectthermal: -653.475942 hartree
zpe.sumelectthermalent: -653.474998 hartree
zpe.sumelectthermalfe: -653.529067 hartree
dipole: 3.0883 -5.3199 2.4889
dipole: 6.6358
quadrupole: -95.0852 -121.8016 -98.2672
quadrupole: -4.0488 -4.1153 -6.0282
quadrupole: 9.9662 -16.7503 6.7841 -4.0488 -4.1153 -6.0282
hfenergy: -653.7374534 hartree
pointgroup: C01[X(C13H15O2)]
dipole: 1.1384689 -2.0396896 1.1659576 debye
polarizability: 222.8522028|0.0523404|177.2028298|-1.3254425|-4.907577|161.7853216 unknown
InChI: InChI=1S/C13H15O2/c1-7-9(14)13(4)8-10(15)11(7,2)5-6-12(8,13)3/h5-6,8H,1-4H3
charge -1 multiplicity 1
30 atoms
C  -0.5529452 -1.23454791 -0.81960403
O  -1.04311125 -1.97456211 -1.65483929
H  1.51095705 -1.49754638 -1.47658402
C  1.27795608 0.45738326 -0.38110475
C  0.15367487 1.48316699 -0.19615777
C  -1.15295067 1.0054571 -0.06038348
C  0.89283373 -0.96218862 -0.74959554
C  1.47798165 -0.69116745 0.6285238
C  0.53885017 -0.79895169 1.77068776
C  -0.78938522 -0.7345594 1.59580478
C  -1.37500412 -0.49039234 0.2203523
O  0.50569193 2.69680685 -0.21220568
C  -2.82984513 -0.91967758 0.13750312
C  2.48976566 1.05536686 -1.04870233
C  2.86725475 -1.2064553 0.92542301
C  -2.24851381 1.98657717 0.2238969
H  0.97507439 -0.85867917 2.77346933
H  -1.47221661 -0.74020603 2.45347408
H  -3.43845894 -0.39307342 0.88754971
H  -3.24535068 -0.70881719 -0.85829941
H  -2.92743981 -2.00171677 0.3164716
H  2.20039976 1.50914438 -2.00903689
H  2.89654172 1.86546051 -0.42690441
H  3.27840195 0.31697453 -1.24631334
H  3.36251862 -0.58145167 1.68705423
H  2.81419022 -2.23362819 1.32187649
H  3.51262995 -1.230062 0.03804214
H  -2.60559328 1.9812225 1.27631885
H  -1.83795345 2.99054535 0.03237596
H  -3.15058833 1.86123574 -0.40465413
