program: Gaussian 16
title: Title Card Required
version: ES64L-G16RevC.01
frameworkgroup: C1[X(C13H15O2)]
method: RPBE1PBE
basis: def2SVP
operation: Freq
keyword: #P
keyword: Geom=AllCheck
keyword: Guess=TCheck
keyword: SCRF=Check
keyword: GenChk
keyword: RPBE1PBE/def2SVP
keyword: Freq
converged: YES YES YES YES
title: Mulliken charges:
elementType: C H O O H C C C C C C C C C C C C H H H H H H H H H H H H H
charge: 0.341972 0.015086 -0.379023 -0.284365 0.027877 -0.353252 0.321607 -0.391583 -0.384800 -0.062707 -0.066781 -0.273411 -0.078679 0.059521 0.076452 0.045111 0.048472 -0.024403 0.033387 0.021078 0.028286 0.026249 0.035111 0.031659 0.041897 0.038772 0.025015 0.027247 0.026300 0.027904
chargesum: -1.00000
title: Mulliken charges with hydrogens summed into heavy atoms:
elementType: C O O C C C C C C C C C C C C
charge: 0.341972 -0.379023 -0.284365 -0.353252 0.321607 -0.391583 -0.384800 -0.034830 -0.091184 -0.273411 -0.063593 0.142272 0.169472 0.150794 0.129923
polarizability: 2.05140617e+02 4.79328132e+00 1.93444817e+02 1.67555865e+00 -1.42503493e+01 1.86781796e+02
1716.lowfreq: -315.7494 -0.0008 -0.0005 0.0003 3.3637 20.0596 25.0965 93.8404 100.1304
frequency: -315.7386 93.7066 100.1032 101.4552 133.7699 150.3042 158.7891 174.0993 221.1257 248.7245 266.4531 297.3149 321.9638 328.4698 356.1760 397.7812 415.1708 444.0772 470.4446 484.2606 494.7489 533.8640 567.8724 586.7604 648.1420 673.3475 724.5624 748.5605 813.1440 823.3706 844.3536 884.4614 945.4347 949.2718 961.9650 991.8513 1014.1095 1028.7683 1041.0552 1066.5605 1080.3649 1086.2249 1106.4334 1135.0105 1155.7367 1191.9787 1237.5996 1250.5664 1293.7479 1318.6201 1321.5139 1362.9343 1374.5364 1379.4307 1383.1849 1399.2946 1428.9484 1429.8500 1431.9636 1440.6977 1443.1932 1445.3873 1449.3566 1455.9499 1464.5627 1469.7508 1517.1891 1658.1032 1783.0360 3029.0166 3040.6694 3048.3872 3055.8117 3097.8219 3121.3443 3125.8192 3127.0843 3139.1292 3146.5012 3150.3847 3157.0149 3161.8155 3169.8248 3173.3095
redmass: 7.1542 1.4245 1.5558 2.9076 1.3990 2.8356 1.5353 1.1703 2.1193 2.3102 2.7712 2.6003 3.0662 2.5435 3.2867 5.2853 5.1775 4.9312 3.7923 5.4136 3.6605 1.6882 3.3515 5.2730 4.4005 5.7626 3.6104 5.1242 4.1697 2.9459 2.6495 2.6681 1.9902 1.4685 1.3964 1.3876 1.4625 1.6749 1.5704 1.5194 1.5069 1.8169 1.4221 2.4240 2.9142 1.8066 3.2142 1.7048 2.8768 4.2445 3.3448 1.5702 1.3716 1.4051 1.3316 2.5283 1.4069 1.0499 1.5244 1.1600 1.0559 1.1033 1.1095 1.1074 1.3045 3.5037 5.9998 11.2232 11.9612 1.0389 1.0410 1.0401 1.0392 1.1023 1.0877 1.0989 1.1019 1.1023 1.1023 1.0918 1.0912 1.1035 1.1004 1.1024
irintensity: 419.7019 2.3001 1.6872 3.1753 2.0920 7.5682 10.5429 0.6641 5.6621 1.0935 5.3154 2.9210 0.9300 3.1193 23.4274 42.2844 3.4696 28.0375 101.6393 24.5919 67.0322 108.6220 32.0780 154.2817 7.1946 241.9774 13.5894 17.7308 10.0114 3.5796 52.3061 28.9505 6.4091 1.4998 18.7029 7.3881 34.7390 6.8924 2.9564 11.5317 28.2860 10.4740 15.0034 9.0205 49.3783 5.5626 3.5186 1.7654 72.9178 16.7047 8.6111 23.7792 8.1850 13.1442 12.3054 44.1730 10.8089 12.6512 48.7465 8.2288 13.1550 11.6556 3.0506 31.9747 28.0934 8.9120 167.3332 718.3271 571.1872 109.5918 69.8426 62.2996 66.3424 40.2220 69.4782 23.0231 40.8264 28.0446 19.8895 56.7277 16.3524 17.1501 25.9904 20.7014
temp: 298.150 k
press: 1.00000 atm
elementType: 6 1 8 8 1 6 6 6 6 6 6 6 6 6 6 6 6 1 1 1 1 1 1 1 1 1 1 1 1 1
symmnumber: 1
zpe: 644461.2 jmol-1
zpe.correction: 0.245462 hartree
zpe.thermalcorrener: 0.259557 hartree
zpe.thermalcorrenthalpy: 0.260501 hartree
zpe.thermalcorrgfe: 0.206138 hartree
zpe.sumelectzpe: -653.474208 hartree
zpe.sumelectthermal: -653.460114 hartree
zpe.sumelectthermalent: -653.459170 hartree
zpe.sumelectthermalfe: -653.513532 hartree
dipole: 0.1218 -0.9389 0.3720
dipole: 1.0173
quadrupole: -91.8259 -121.9189 -102.4468
quadrupole: 6.6520 3.7787 1.0494
quadrupole: 13.5713 -16.5217 2.9504 6.6520 3.7787 1.0494
hfenergy: -653.7196707 hartree
pointgroup: C01 [X(C13H15O2)]
dipole: 0.0403505 -0.3783765 0.1240039 debye
polarizability: 205.3448054|4.4234941|194.9198233|1.5996514|-13.8070322|185.1026013 unknown
InChI: InChI=1S/C13H15O2/c1-10-5-6-11(2)8(14)7(10)13(10,4)9(15)12(6,11)3/h5-7H,1-4H3
charge -1 multiplicity 1
30 atoms
C  0.48343205 -1.32875109 -0.88843749
H  -1.61232791 -1.49656029 -1.36374675
O  -0.31577732 2.68256485 -0.32530306
O  0.82493379 -2.23028928 -1.64327383
H  1.69741968 -0.24188682 2.120082
C  1.09194699 0.86597962 0.27873148
C  -0.16743108 1.44352394 -0.23348408
C  -1.24351035 0.52690666 -0.51285562
C  1.44794851 -0.59492168 -0.0388437
C  0.9120824 -0.29406373 1.35628422
C  -0.40669592 -0.74046515 1.75751874
C  -1.38188506 -0.73519829 0.71913195
C  -0.93305457 -0.94601445 -0.70332585
C  2.21041604 1.85407156 0.47246243
C  2.88425634 -0.99966313 -0.23520591
C  -2.81156268 -1.07367881 1.05530949
C  -2.48989539 1.11702629 -1.10791566
H  -0.74944211 -0.39909742 2.74427657
H  1.78370021 2.7891312 0.86315817
H  2.97544032 1.49354069 1.17530976
H  2.71387788 2.10242623 -0.47798207
H  3.5469534 -0.53823772 0.50886787
H  2.97863048 -2.09286239 -0.14696318
H  3.24697851 -0.72230021 -1.23846988
H  -2.89277785 -2.13934782 1.3271419
H  -3.16183928 -0.48524841 1.9186873
H  -3.50433585 -0.89272122 0.22278509
H  -2.22952924 1.80044962 -1.93521929
H  -3.16661525 0.34812706 -1.50805624
H  -3.05468973 1.72101118 -0.37730535
