program: Gaussian 09
title: 000005469
version: EM64L-G09RevD.01
frameworkgroup: C1[X(C15H18ClN3O3S)]
method: RPBEPBE
basis: SDD
operation: Freq
keyword: #p
keyword: freq=noraman
keyword: PBEPBE/SDD
title: #p freq=noraman PBEPBE/SDD
converged: YES YES NO NO
title: Mulliken charges:
elementType: Cl S O O O N N N C C C C C C C C C C C C C C C H H H H H H H H H H H H H H H H H H
charge: -0.062163 0.235345 -0.260087 -0.434533 -0.184077 -0.085794 -0.127105 -0.208996 -0.342391 -0.366798 -0.395868 -0.382864 -0.346399 0.260555 -0.553566 -0.321979 0.727546 -0.456118 -0.092230 -0.281463 -0.233588 -0.094056 -0.255609 0.185872 0.213145 0.225253 0.196898 0.229728 0.239448 0.230326 0.262744 0.173521 0.230150 0.251422 0.288266 0.237480 0.185051 0.268026 0.251037 0.333357 0.260513
chargesum: 0.00000
title: Mulliken charges with hydrogens summed into heavy atoms:
elementType: Cl S O O O N N N C C C C C C C C C C C C C C C
charge: -0.062163 0.235345 -0.260087 -0.101176 -0.184077 -0.085794 -0.127105 -0.208996 0.056626 0.055353 0.073309 0.110206 0.057272 0.260555 -0.013877 0.100551 0.727546 -0.456118 -0.092230 -0.013436 0.017449 -0.094056 0.004904
polarizability: 2.75125582e+02 -1.49245653e+00 2.49822147e+02 1.54576920e+01 5.90807443e+00 1.35026542e+02
1716.lowfreq: -12.5291 -4.0448 0.0004 0.0008 0.0016 5.3797 10.6705 20.7687 33.7943
frequency: 10.3378 19.6441 33.7273 47.0395 61.0689 66.1910 81.2783 88.2743 91.8088 125.1653 149.9273 164.6294 190.7307 215.1112 235.3990 277.6154 291.4077 302.5076 306.2401 314.5826 325.3280 336.3164 355.8561 368.5480 387.8720 406.8171 432.7978 441.3262 459.1237 464.0812 465.7900 540.7999 547.3533 566.9888 568.4239 599.5329 610.3217 651.0073 684.1716 711.5004 725.3973 765.9410 782.2921 799.6329 800.4198 837.6542 848.7607 862.9118 907.8663 936.2408 951.8298 962.7683 964.9885 997.0229 1025.1496 1040.4851 1042.2021 1048.5528 1062.8206 1067.5085 1074.4110 1091.2919 1128.2972 1138.5455 1142.9253 1170.8047 1172.7980 1197.5655 1212.7991 1231.9102 1255.3013 1266.1570 1288.5265 1293.5042 1303.9623 1305.6838 1319.6286 1332.3227 1338.4366 1344.4723 1353.6336 1360.6779 1370.5248 1389.1780 1396.3314 1415.1749 1429.9323 1453.4273 1456.1788 1460.2856 1462.2530 1466.6310 1468.1719 1471.7425 1481.0771 1580.0795 1600.8962 1606.9238 1666.8115 2834.9073 2843.8351 2871.1729 2962.6359 2984.8833 2991.2799 2996.8739 3043.5302 3048.1772 3050.2989 3063.9044 3097.0112 3097.8884 3103.3614 3159.9468 3180.2740 3184.3647 3559.3738
redmass: 8.1878 5.0520 6.0329 4.8744 2.2126 5.9112 7.5162 4.2100 7.5793 9.9442 4.7280 4.8967 6.4596 3.1901 2.8130 3.4120 5.1995 1.6340 7.9067 3.0012 1.8631 3.2245 6.2789 6.7677 4.0948 2.1293 3.2917 7.4968 7.8313 3.9329 3.3283 3.7564 5.8072 5.5887 5.2026 4.1465 4.6959 3.2130 7.0955 4.0429 7.8472 4.1331 4.1177 1.1892 1.3226 1.5636 1.5459 5.1124 3.1166 1.3420 2.8708 3.2171 3.0481 2.7183 4.2782 2.2081 2.4147 1.8989 3.9564 2.3241 1.7795 2.1504 2.1424 1.5559 2.6043 2.0152 2.1858 1.0788 1.9545 2.0848 1.2496 1.4299 1.3235 1.1735 1.5238 1.3862 2.4960 1.4324 1.4335 1.3532 1.3183 1.3185 1.3698 9.4475 1.4437 2.2334 2.7672 1.3713 1.0805 1.1076 1.1375 1.7723 1.3680 1.0953 1.0875 8.3433 7.9014 8.4015 11.5606 1.0714 1.0705 1.0702 1.0696 1.0679 1.0664 1.0604 1.0878 1.0873 1.0899 1.1010 1.0960 1.0943 1.0960 1.0896 1.0929 1.0966 1.0662
irintensity: 0.0032 0.3734 0.9798 2.7263 2.8832 4.3808 1.0836 2.3266 2.4119 0.2930 0.4911 0.9811 1.4520 2.9592 3.2295 8.2047 10.8761 82.8681 5.7345 7.3018 38.3626 51.4375 3.7030 3.0638 7.2742 3.1657 13.6435 10.1365 4.0788 4.7140 3.1033 1.0788 20.9515 18.9559 6.1672 30.3779 4.9363 8.5581 2.5836 0.0817 13.1218 4.8887 15.9455 7.0496 35.7563 0.7203 29.1772 40.2242 8.9692 0.0259 3.4066 135.6238 2.1499 103.0958 44.2599 5.1433 9.0857 4.0670 13.4986 16.1860 22.0678 15.7602 15.5299 20.3133 57.1150 19.7164 92.9536 5.3536 49.5754 130.5347 9.6905 18.1060 16.9533 14.8854 19.6437 35.8232 36.4340 15.9648 26.7386 9.7535 6.1471 1.6001 4.4519 8.5080 2.9110 88.5136 13.8194 43.7844 0.9835 11.0064 15.1163 105.5592 60.5552 2.3478 7.9758 49.9411 35.9560 369.9407 472.8791 46.9693 108.3428 109.2230 60.1348 25.0172 44.5128 32.4747 1.5735 57.9526 40.7010 4.7930 9.0809 18.2268 26.7971 2.1275 2.9245 0.9542 9.4673
temp: 298.150 k
press: 1.00000 atm
elementType: 17 16 8 8 8 7 7 7 6 6 6 6 6 6 6 6 6 6 6 6 6 6 6 1 1 1 1 1 1 1 1 1 1 1 1 1 1 1 1 1 1
symmnumber: 1
zpe: 831405.1 jmol-1
zpe.correction: 0.316665 hartree
zpe.thermalcorrener: 0.338922 hartree
zpe.thermalcorrenthalpy: 0.339866 hartree
zpe.thermalcorrgfe: 0.261725 hartree
zpe.sumelectzpe: -1828.728104 hartree
zpe.sumelectthermal: -1828.705848 hartree
zpe.sumelectthermalent: -1828.704903 hartree
zpe.sumelectthermalfe: -1828.783045 hartree
dipole: -2.3076 2.6011 -2.9958
dipole: 4.5897
quadrupole: -158.6060 -165.4707 -149.3159
quadrupole: 4.9442 4.1911 -0.1926
quadrupole: -0.8085 -7.6732 8.4816 4.9442 4.1911 -0.1926
hfenergy: -1829.0447698 hartree
pointgroup: C01 [X(C15H18Cl1N3O3S1)]
dipole: 0.9081537 1.2540566 0.9291304 debye
polarizability: 275.0407746|4.8573543|241.7506175|15.1677675|-29.9171224|143.1828786 unknown
InChI: InChI=1S/C15H18ClN3O3S/c16-11-1-2-13-12(9-11)19(15(22)23-13)10-14(21)18-5-3-17(4-6-18)7-8-20/h1-2,9,20H,3-8,10H2
charge 0 multiplicity 1
41 atoms
Cl -2.65069 4.135717 -0.755033
S  -4.579351 -1.841764 0.506177
O  -0.448869 -0.936219 -1.508622
O  7.74344 1.256261 0.581952
O  -2.274622 -3.210004 1.277452
N  4.259789 -0.014981 -0.261278
N  1.538345 -0.946239 -0.291107
N  -2.076186 -0.917163 0.71908
C  3.406384 0.118142 0.942319
C  3.440256 0.086335 -1.496907
C  2.32524 -0.98423 0.95898
C  2.366081 -1.015546 -1.517692
C  5.430739 0.892194 -0.255449
C  0.156905 -0.927413 -0.396186
C  -0.631452 -0.88717 0.943848
C  6.571773 0.37046 0.643915
C  -2.829997 0.184854 0.270207
C  -4.213003 -0.107908 0.114387
C  -2.767052 -2.128082 0.898067
C  -2.336951 1.479726 0.004495
C  -5.118108 0.880898 -0.304729
C  -3.264986 2.453891 -0.405522
C  -4.640019 2.187158 -0.56595
H  2.905368 1.120933 0.981209
H  4.028976 0.016096 1.848933
H  4.102393 -0.041444 -2.371893
H  2.940918 1.084173 -1.584444
H  1.674135 -0.849678 1.836347
H  2.823683 -1.970605 1.044935
H  2.858413 -2.006793 -1.564718
H  1.693604 -0.907029 -2.383554
H  5.154036 1.933595 0.05822
H  5.825609 0.964542 -1.284998
H  -0.37217 0.015464 1.528614
H  -0.385947 -1.775834 1.552499
H  6.927293 -0.601436 0.269209
H  6.232394 0.238537 1.693186
H  -1.274168 1.719474 0.080736
H  -6.180969 0.654179 -0.428735
H  7.498417 2.14628 0.941983
H  -5.32315 2.975529 -0.891533
