program: Gaussian 16
title: Title Card Required
version: ES64L-G16RevC.01
method: RPBE1PBE
basis: def2SVP
operation: Freq
keyword: #N
keyword: Geom=AllCheck
keyword: Guess=TCheck
keyword: SCRF=Check
keyword: GenChk
keyword: RPBE1PBE/def2SVPFreq
converged: YES YES NO YES
title: Mulliken charges:
elementType: C C C C C C C O H C C O H C S C C C C C C C C C H H H H H H H H H H H H H H H H H
charge: -0.220864 0.048085 -0.351876 -0.156087 0.020915 -0.353428 0.218724 -0.307819 0.010582 -0.246680 0.165096 -0.349288 0.030830 0.062665 0.039452 -0.064362 -0.046700 -0.027831 -0.050072 -0.041374 -0.042421 0.050145 0.012206 0.083791 0.024878 0.018580 0.022775 0.042403 0.039995 0.037912 0.041250 0.032210 0.031152 0.030591 0.024962 0.017006 0.017509 0.024074 0.035348 0.042082 0.033585
chargesum: -1.00000
title: Mulliken charges with hydrogens summed into heavy atoms:
elementType: C C C C C C C O C C O C S C C C C C C C C C
charge: -0.220864 0.058667 -0.351876 -0.156087 0.051745 -0.353428 0.218724 -0.307819 -0.246680 0.165096 -0.349288 0.128897 0.039452 -0.064362 -0.004296 0.012164 -0.012161 -0.000124 -0.010211 0.136849 0.070795 0.194806
1716.lowfreq: -418.2086 -9.7697 -0.0009 -0.0008 0.0005 8.7041 15.4944 24.3985 43.8852
frequency: -418.2084 21.5864 43.6099 54.0973 63.5307 113.0069 120.6616 132.9757 153.7830 159.8981 165.4527 181.1793 192.4946 194.9423 212.6830 218.0426 230.3624 240.5215 271.5219 289.3802 311.9326 325.6999 390.7459 404.7916 417.4487 436.0321 451.6754 470.2874 489.2066 498.1754 540.3479 584.6490 608.0131 626.1153 638.3560 684.2503 716.9706 719.2159 738.0669 765.3349 771.1894 815.4154 825.9851 854.5841 857.0401 911.7613 916.5663 924.3403 932.0260 946.0047 975.2249 978.5847 1001.9588 1005.9947 1011.8129 1020.7815 1023.8577 1039.5519 1042.4417 1048.6054 1057.0375 1087.9514 1102.4937 1107.0331 1123.3563 1127.6634 1155.9874 1164.7010 1185.4788 1198.3516 1209.5122 1297.7627 1303.7056 1313.0871 1320.3395 1333.6337 1360.7431 1371.1117 1379.3726 1390.2014 1390.5012 1427.2705 1433.5692 1435.5141 1440.6161 1442.3630 1446.2014 1448.3671 1453.7346 1459.6933 1474.5000 1478.2096 1510.4499 1511.9208 1652.5761 1669.8732 1705.6253 1774.5307 2992.7001 3008.0792 3043.6507 3053.8832 3054.2790 3082.7164 3133.3573 3133.8176 3137.2323 3138.2633 3147.4872 3151.1573 3165.6359 3197.0741 3199.4565 3205.4074 3213.1981 3225.1571 3232.2248
redmass: 8.6525 4.5082 3.2522 3.9285 1.3456 4.6147 3.3315 4.0864 4.6393 1.3710 2.4009 1.9630 1.1112 3.1977 1.1718 3.7118 3.0718 2.7289 3.4256 4.0419 3.9089 4.3071 5.5001 4.5761 2.8903 8.3087 5.6097 8.5309 3.5187 4.1326 3.8141 3.9242 4.2334 6.3039 5.8952 4.0590 6.0761 1.7343 4.0219 1.9819 3.9873 6.0012 4.3447 2.1174 1.2707 2.0935 1.6986 1.4140 1.9439 1.4180 1.9880 2.1342 1.3963 2.2614 4.9929 1.7968 1.3551 1.5146 1.7094 1.6355 2.3560 2.1959 1.5050 2.5545 2.4180 3.1367 1.0594 2.2220 1.1233 1.5970 2.7793 2.7845 3.2274 3.4041 1.5016 1.8808 1.3191 1.3821 1.6368 6.2778 2.2054 1.9165 1.2619 1.0812 1.1916 1.2199 1.0753 1.0769 1.0783 1.3364 2.4578 2.6671 5.2455 2.3682 6.4697 6.3520 11.8836 12.2224 1.0433 1.0434 1.0374 1.0425 1.0939 1.0963 1.1033 1.0976 1.0926 1.0999 1.1032 1.1037 1.1031 1.0878 1.0925 1.0893 1.0949 1.0984 1.0960
irintensity: 767.4346 0.0401 0.5164 2.7674 2.0460 2.0294 4.8429 0.9762 12.6861 2.2719 3.1607 1.3345 0.3499 13.9444 2.3356 4.6149 1.8841 10.1302 1.4293 10.4638 16.3787 16.6427 21.3281 4.2612 0.0380 3.3016 3.4358 6.6592 7.8339 28.5684 1.6291 16.6642 4.4598 4.7875 17.4941 3.4022 18.3879 50.2965 3.1232 45.7663 10.7869 1.3154 3.1609 40.8171 2.2889 6.1991 3.8248 2.3081 25.1755 9.0643 15.5366 27.1584 0.1711 27.7081 1.3629 38.0294 4.6359 11.7586 31.9430 21.5475 24.4205 2.8398 8.3982 37.2011 21.8423 18.9353 0.3529 0.6799 3.9776 34.9236 1.5693 10.8951 26.4814 6.0346 0.3937 40.2760 5.6337 18.5596 43.7645 7.1245 18.1459 31.1988 1.7767 6.3577 1.7470 22.2654 10.4877 1.2260 22.1837 55.2309 14.8488 46.1656 242.3660 47.8820 4.4235 78.6539 754.2687 688.2626 216.9456 125.0618 50.8813 63.1846 58.1844 32.2450 21.6027 20.8128 37.0787 27.1609 25.5118 22.6946 15.0304 1.6592 8.0664 0.3971 15.7422 7.1824 19.7475
temp: 298.150 k
press: 1.00000 atm
elementType: 6 6 6 6 6 6 6 8 1 6 6 8 1 6 16 6 6 6 6 6 6 6 6 6 1 1 1 1 1 1 1 1 1 1 1 1 1 1 1 1 1
symmnumber: 1
zpe: 861554.1 jmol-1
zpe.correction: 0.328149 hartree
zpe.thermalcorrener: 0.348679 hartree
zpe.thermalcorrenthalpy: 0.349623 hartree
zpe.thermalcorrgfe: 0.279079 hartree
zpe.sumelectzpe: -1281.964657 hartree
zpe.sumelectthermal: -1281.944127 hartree
zpe.sumelectthermalent: -1281.943183 hartree
zpe.sumelectthermalfe: -1282.013726 hartree
dipole: -10.2639 -5.3711 -0.8538
dipole: 11.6158
quadrupole: -175.7430 -152.6016 -151.3724
quadrupole: -19.6775 7.4398 -0.4613
quadrupole: -15.8373 7.3041 8.5333 -19.6775 7.4398 -0.4613
hfenergy: -1282.2928059 hartree
pointgroup: C01 [X(C19H19O2S1)]
dipole: -4.0519303 -2.0945711 -0.3301703 debye
polarizability: 397.9563602|-15.882437|306.5550413|-14.5132098|-6.1348324|223.7498516 unknown
InChI: InChI=1S/C19H19O2S/c1-11-10-17(3)16-18(4,14(11)20)15(21)12(2)19(16,17)22-13-8-6-5-7-9-13/h5-10,16H,1-4H3
charge -1 multiplicity 1
41 atoms
C  1.18702991 -1.49612666 -0.58793233
C  2.2369213 -1.11252123 0.43002144
C  0.56609671 -0.24629106 1.2685492
C  -0.04424373 -0.9436456 0.08170213
C  0.58138013 -0.22176071 -1.09939951
C  1.26741848 1.0590942 -0.64162996
C  0.98506518 1.07890938 0.88311238
O  1.3036474 2.01738427 1.6040597
H  2.46058381 -1.87349121 1.19065036
C  3.28099357 -0.2644807 -0.02353605
C  2.82881456 0.89345499 -0.72872749
O  3.51680844 1.76997434 -1.2634752
H  0.07254069 -0.25388815 -2.06620215
C  0.8165659 2.3223737 -1.34006855
S  -1.60238629 -1.77608272 0.04064658
C  -2.80809033 -0.48616269 -0.02712402
C  -2.49631775 0.86894083 0.13959879
C  -3.50626895 1.82895767 0.08051015
C  -4.8319615 1.45660562 -0.13835078
C  -5.14365191 0.10452786 -0.29717034
C  -4.14322072 -0.8619798 -0.24363057
C  0.26586069 -0.61532753 2.67885016
C  4.6873664 -0.31575001 0.49816708
C  1.31590557 -2.72185319 -1.44221173
H  1.21089127 3.19628575 -0.80224503
H  -0.28219794 2.39666722 -1.37355532
H  1.20462689 2.36075006 -2.36889528
H  -1.46558925 1.17223158 0.32721563
H  -3.24560955 2.8827115 0.21173024
H  -5.61860121 2.2136845 -0.18443102
H  -6.17841278 -0.20368721 -0.46998467
H  -4.39606844 -1.91791074 -0.37682424
H  -0.79230774 -0.42601629 2.9443993
H  0.88647843 -0.01385258 3.36164901
H  0.45601922 -1.68256358 2.88446076
H  5.21252375 -1.26061614 0.26633252
H  5.2665299 0.50279893 0.04245029
H  4.74573489 -0.18662032 1.59723386
H  1.39818199 -3.632688 -0.82600492
H  2.21712964 -2.65837437 -2.07301088
H  0.44416835 -2.83618788 -2.10469255
