program: Gaussian 16
title: Title Card Required
version: ES64L-G16RevC.01
method: RPBE1PBE
basis: def2SVP
operation: Freq
keyword: #N
keyword: Geom=AllCheck
keyword: Guess=TCheck
keyword: SCRF=Check
keyword: GenChk
keyword: RPBE1PBE/def2SVPFreq
converged: YES YES NO YES
title: Mulliken charges:
elementType: C C C C C C C O H C C O H C S C C C C C C C C C H H H H H H H H H H H H H H H H H
charge: -0.215900 0.052322 -0.166699 -0.302005 0.078534 -0.367087 0.096380 -0.397220 0.011273 -0.233313 0.224544 -0.273710 0.034521 0.055291 0.026727 -0.079323 -0.035840 -0.036382 -0.052094 -0.044581 -0.036475 0.024286 0.021496 0.046438 0.030013 0.024077 0.020328 0.052558 0.037245 0.035466 0.039718 0.028675 0.015094 0.011344 0.016731 0.032954 0.050263 0.054448 0.041728 0.041205 0.036969
chargesum: -1.00000
title: Mulliken charges with hydrogens summed into heavy atoms:
elementType: C C C C C C C O C C O C S C C C C C C C C C
charge: -0.215900 0.063595 -0.166699 -0.302005 0.113055 -0.367087 0.096380 -0.397220 -0.233313 0.224544 -0.273710 0.129708 0.026727 -0.079323 0.016718 0.000863 -0.016628 -0.004864 -0.007800 0.067455 0.159161 0.166340
1716.lowfreq: -18.2589 -0.0009 0.0009 0.0018 9.4337 17.2806 35.3343 44.9217 64.8767
frequency: 32.8494 44.6836 64.7606 82.0010 90.5568 127.2153 151.1325 159.5611 164.6131 185.1872 189.4618 195.8321 198.2769 225.2073 230.1906 239.6164 253.5564 276.9030 290.6534 312.0451 347.4015 353.7529 360.4009 411.1480 422.0981 434.4509 460.7696 467.2458 484.0456 493.5303 541.4042 556.2228 599.5145 625.9445 629.1944 655.9101 704.0283 716.9310 722.7790 733.0959 763.1840 779.4911 831.1908 843.9223 862.4520 868.1851 899.6925 925.2551 927.4188 942.8829 984.4844 1003.5003 1006.1743 1009.8977 1013.3202 1022.4556 1037.2250 1039.7921 1048.3575 1050.2687 1055.6798 1066.2263 1097.3351 1101.8330 1117.2927 1126.0221 1152.5454 1154.6918 1181.1639 1211.6847 1259.4655 1277.0968 1310.6141 1316.9059 1344.2122 1362.7088 1366.7464 1374.0279 1387.6760 1389.3009 1397.1491 1424.8032 1427.4694 1433.1190 1439.4885 1441.1236 1445.6462 1447.9126 1448.8320 1460.1555 1464.4099 1476.6977 1509.1290 1650.0531 1668.8355 1708.5245 1725.2654 1783.8216 2978.8886 3037.8202 3043.1940 3047.0167 3049.0141 3121.9333 3126.8134 3130.5039 3134.7461 3148.2194 3162.1729 3162.5370 3165.0481 3171.1279 3195.1681 3203.1774 3211.5176 3224.6746 3238.6878
redmass: 5.0089 4.8456 3.8849 5.5213 3.5940 3.5142 1.7014 7.8525 1.5827 1.6923 1.7114 1.0871 1.3978 2.4513 2.5707 3.0994 3.2414 2.8802 2.9336 4.5392 4.4469 3.8943 3.7370 7.3493 2.9345 9.8927 5.5199 8.2991 4.0616 3.1569 3.6882 3.8525 5.2854 5.3893 4.4855 4.2616 5.5661 6.3915 1.7715 5.8732 1.8160 4.5094 4.5052 2.5448 1.2552 3.0829 1.5487 1.9757 1.4125 2.0438 1.7651 1.6074 2.0293 4.2134 1.8695 1.3144 1.4144 1.9854 1.6019 1.6936 2.3086 1.6254 1.8145 2.1730 2.3149 3.0762 1.8297 1.0608 1.1279 1.8351 3.1030 3.0891 2.1279 1.6547 1.4134 1.6015 2.4333 1.3673 1.7855 5.3818 2.2607 1.2131 1.7018 1.7876 1.0902 1.1205 1.1058 1.0786 1.0580 1.6459 1.6702 2.5766 2.3110 6.4674 6.3636 9.4193 9.6280 12.4702 1.0449 1.0962 1.0391 1.0376 1.0382 1.0976 1.1028 1.1011 1.1045 1.0909 1.1045 1.0946 1.1001 1.1020 1.0878 1.0894 1.0950 1.0994 1.0940
irintensity: 0.7796 0.5864 0.6626 2.6494 0.8263 3.5030 4.4752 6.1332 3.3033 0.8471 1.5197 1.5553 4.9285 0.8619 2.6420 1.9337 2.3855 2.0116 3.8501 8.6901 16.6427 3.7260 1.5189 9.1599 0.1173 4.9045 5.0092 6.2493 13.8167 12.8931 1.2224 6.8918 26.5162 0.4791 13.3430 5.5840 48.8031 20.5070 46.6767 24.4817 49.3170 18.0388 5.2222 22.2308 0.0627 6.2663 25.0294 27.7700 8.9572 40.8753 24.7987 4.7421 18.7494 19.6921 65.8175 0.7601 20.4752 42.7015 3.9636 1.8979 33.0018 15.3114 5.6355 5.2334 9.0601 66.7341 5.0013 0.5450 3.4503 4.6167 10.9076 35.2369 21.0992 11.7349 69.1852 31.5654 2.6785 6.2630 24.9514 14.0300 4.5822 9.6214 13.5706 56.4459 9.1564 8.1463 14.0476 16.1091 7.5253 33.0515 30.5492 10.0695 106.7198 4.4101 145.0651 332.6370 242.5790 959.9212 179.0119 60.9383 62.4428 68.4663 34.7068 27.1362 31.3924 13.5042 34.5795 30.8110 18.9962 5.3850 13.2215 10.3252 3.0463 0.6142 17.0345 14.6523 4.4745
temp: 298.150 k
press: 1.00000 atm
elementType: 6 6 6 6 6 6 6 8 1 6 6 8 1 6 16 6 6 6 6 6 6 6 6 6 1 1 1 1 1 1 1 1 1 1 1 1 1 1 1 1 1
symmnumber: 1
zpe: 865206.6 jmol-1
zpe.correction: 0.329540 hartree
zpe.thermalcorrener: 0.350263 hartree
zpe.thermalcorrenthalpy: 0.351208 hartree
zpe.thermalcorrgfe: 0.281191 hartree
zpe.sumelectzpe: -1281.996408 hartree
zpe.sumelectthermal: -1281.975685 hartree
zpe.sumelectthermalent: -1281.974741 hartree
zpe.sumelectthermalfe: -1282.044757 hartree
dipole: 10.3083 5.0037 -5.1076
dipole: 12.5454
quadrupole: -184.0053 -144.0473 -152.7423
quadrupole: -4.6489 12.3883 11.1783
quadrupole: -23.7404 16.2177 7.5226 -4.6489 12.3883 11.1783
hfenergy: -1282.3259482 hartree
pointgroup: C01 [X(C19H19O2S1)]
dipole: 4.0560827 1.9693757 -2.0103262 debye
polarizability: 423.3678907|5.7278245|278.4014796|4.5855199|17.4124137|233.9333077 unknown
InChI: InChI=1S/C19H19O2S/c1-11-10-17(3)16-18(4,14(11)20)15(21)12(2)19(16,17)22-13-8-6-5-7-9-13/h5-10,16H,1-4H3
charge -1 multiplicity 1
41 atoms
C  -0.39561016 0.68306516 -1.12112993
C  -1.0587702 1.78364854 -0.42367942
C  -0.52650154 -0.88755371 1.06092741
C  0.00599098 -0.61555346 -0.27701357
C  -1.1545195 -0.60230891 -1.24086692
C  -2.42831078 -0.78751289 -0.42668198
C  -1.90843496 -1.10655243 1.03997663
O  -2.70557721 -1.42037566 1.94166652
H  -0.4849259 2.71065247 -0.29508679
C  -2.32916948 1.72488316 0.0352005
C  -3.1593757 0.51262066 -0.20015146
O  -4.37584746 0.56961113 -0.10586289
H  -1.07580719 -1.1405555 -2.1916889
C  -3.35041154 -1.87652686 -0.93184841
S  1.5051169 -1.47181456 -0.78239658
C  2.81294014 -0.44722089 -0.18862596
C  2.60985051 0.77296392 0.47015703
C  3.70203463 1.52411132 0.90233659
C  5.00631906 1.07803357 0.68958487
C  5.20990386 -0.13855275 0.03477889
C  4.1270301 -0.89661035 -0.40106678
C  0.29135593 -0.99366013 2.3009573
C  -3.01183631 2.87254545 0.70805801
C  0.46759301 1.1151577 -2.28213522
H  -4.13163627 -2.05651163 -0.18076095
H  -2.79047224 -2.81334582 -1.0822233
H  -3.83584999 -1.60290223 -1.88273757
H  1.59471774 1.13137432 0.64470156
H  3.52464959 2.47287938 1.41652022
H  5.85756434 1.67149399 1.03197027
H  6.22532782 -0.50487665 -0.13988166
H  4.29788421 -1.84831585 -0.91273059
H  1.18246528 -1.63867794 2.17611528
H  -0.33353173 -1.42871851 3.09781943
H  0.66724639 -0.02077698 2.67816685
H  -2.34687811 3.74447568 0.79145931
H  -3.91850395 3.16726763 0.15646339
H  -3.34645159 2.59044622 1.72058108
H  1.21001912 1.86723291 -1.96972429
H  -0.1536929 1.56611206 -3.07425806
H  1.00884506 0.26447449 -2.7184829
