program: Gaussian 16
title: Title Card Required
version: ES64L-G16RevC.01
method: RPBE1PBE
basis: def2SVP
operation: Freq
keyword: #N
keyword: Geom=AllCheck
keyword: Guess=TCheck
keyword: SCRF=Check
keyword: GenChk
keyword: RPBE1PBE/def2SVPFreq
converged: YES YES NO YES
title: Mulliken charges:
elementType: C C C C C C C O H C C O H C S C C C C C C C C C H H H H H H H H H H H H H H H H H
charge: -0.150235 0.067541 -0.326732 -0.153916 -0.046665 -0.319528 0.213799 -0.247396 -0.004577 -0.278449 0.129044 -0.415993 0.038867 0.071211 0.044529 -0.069099 -0.049774 -0.033693 -0.048768 -0.039893 -0.038031 0.054477 0.006270 0.078973 0.022990 0.016129 0.022454 0.052437 0.039034 0.038818 0.042739 0.033747 0.036655 0.041092 0.030634 0.008026 0.009663 0.008745 0.032570 0.046229 0.036076
chargesum: -1.00000
title: Mulliken charges with hydrogens summed into heavy atoms:
elementType: C C C C C C C O C C O C S C C C C C C C C C
charge: -0.150235 0.062964 -0.326732 -0.153916 -0.007799 -0.319528 0.213799 -0.247396 -0.278449 0.129044 -0.415993 0.132784 0.044529 -0.069099 0.002663 0.005341 -0.009950 0.002846 -0.004284 0.162858 0.032705 0.193848
1716.lowfreq: -3.0367 -0.0027 -0.0021 0.0005 10.2170 17.3556 29.4027 49.2901 62.0605
frequency: 27.0081 49.1113 61.9722 96.7210 116.1741 120.5447 129.7515 142.9194 146.8051 161.7207 167.8316 190.8567 197.1234 204.8117 221.0218 227.6451 241.0324 268.7170 291.7377 303.7182 313.5881 404.7941 419.8854 420.9875 427.7264 440.1612 482.1672 492.6902 504.6448 515.7188 554.7312 604.6233 626.6198 656.7497 682.1718 713.4945 722.7045 731.3436 759.2719 766.0798 799.5420 829.5773 854.7930 860.7745 875.9016 898.2277 906.0780 928.7080 934.6004 947.7911 962.3579 1003.8117 1007.2532 1011.1343 1023.7424 1025.0231 1040.4274 1044.3718 1056.1758 1069.1215 1090.7909 1100.8775 1109.6440 1120.5793 1127.6917 1151.2023 1155.9321 1170.3396 1182.1438 1184.4646 1196.0968 1230.3294 1258.0650 1316.3007 1318.2569 1321.4129 1349.6221 1359.6004 1375.6107 1390.2767 1391.9704 1407.6769 1433.1910 1435.6989 1437.9804 1439.0372 1440.6996 1443.0590 1445.6571 1446.9079 1468.5690 1476.5202 1504.2956 1511.0310 1654.1809 1669.8169 1714.9362 1848.6488 2956.6458 3010.9448 3041.3206 3052.8026 3053.6384 3084.0575 3120.7927 3131.4731 3141.6810 3143.6146 3147.8168 3157.8443 3168.3829 3197.0185 3197.4370 3205.7539 3213.5817 3226.5258 3244.4407
redmass: 4.7855 4.8642 4.1517 2.7227 4.5777 1.2730 3.5078 2.1047 3.2986 1.6386 1.1795 2.1514 2.5476 1.4049 2.7204 2.9004 2.6482 3.5198 3.9692 4.7590 4.2355 6.0249 4.2409 3.6448 4.6928 6.7483 5.0121 3.1687 5.4035 4.9995 4.3208 4.1515 6.3460 5.8309 3.9265 6.3252 1.7378 4.3123 3.5404 1.8494 3.9487 6.2680 2.8667 1.2561 2.5363 2.5900 2.4544 1.3940 1.6548 1.7950 1.9536 1.3701 2.3101 5.5174 1.9498 1.5647 1.5771 1.5988 2.3356 2.0170 2.0364 1.4646 2.2981 2.6756 2.6288 2.0231 1.0695 1.6575 1.1320 1.9357 2.6623 3.2527 3.4423 1.4209 3.5426 2.0396 1.3191 1.7303 1.3476 6.5137 2.0606 2.6759 1.1201 1.1681 1.0660 1.2687 1.1279 1.0642 1.0662 1.0715 1.8171 2.5486 5.8862 2.3141 6.5084 6.3832 10.4366 12.7468 1.0496 1.0928 1.0372 1.0385 1.0378 1.0882 1.0955 1.1034 1.1038 1.1030 1.1019 1.1038 1.1032 1.0883 1.0921 1.0894 1.0951 1.0996 1.0935
irintensity: 0.2658 1.8755 0.0437 0.6922 2.1824 0.3764 0.4220 0.6430 5.8884 2.4274 2.6315 1.2390 0.5560 1.0006 3.5753 2.1498 1.7000 4.3706 6.5432 23.7684 14.0310 4.6071 4.1939 2.6594 2.0778 5.2511 6.0080 11.1534 5.3365 7.0126 3.5474 2.2349 1.2742 4.4232 3.5021 15.0730 49.6858 8.0713 3.3394 50.8018 19.9255 3.9992 13.4782 0.5475 17.0686 10.0828 9.2173 3.6840 3.5098 60.2757 3.4712 0.1926 72.2473 1.5436 32.5562 18.5835 18.1360 3.0421 27.1972 5.3033 11.4240 18.6277 18.7909 18.4521 34.7626 10.1764 0.1055 14.1584 1.8860 9.9171 11.2112 5.4280 7.4718 2.6801 10.8887 0.9660 42.0633 6.6352 5.7050 3.9588 7.0427 15.7062 10.2826 28.5887 2.6549 32.1450 28.2945 5.8978 21.7225 12.4819 20.2309 12.6447 2.9631 86.0435 4.0147 97.2079 758.7554 540.0406 234.5684 96.4257 46.4654 73.9693 23.2719 60.9505 26.1661 26.1627 16.7264 20.2664 28.4731 20.8683 16.2008 1.8445 7.5348 0.3169 14.5824 13.2008 3.1122
temp: 298.150 k
press: 1.00000 atm
elementType: 6 6 6 6 6 6 6 8 1 6 6 8 1 6 16 6 6 6 6 6 6 6 6 6 1 1 1 1 1 1 1 1 1 1 1 1 1 1 1 1 1
symmnumber: 1
zpe: 866465.2 jmol-1
zpe.correction: 0.330019 hartree
zpe.thermalcorrener: 0.350607 hartree
zpe.thermalcorrenthalpy: 0.351551 hartree
zpe.thermalcorrgfe: 0.281452 hartree
zpe.sumelectzpe: -1281.979928 hartree
zpe.sumelectthermal: -1281.959340 hartree
zpe.sumelectthermalent: -1281.958396 hartree
zpe.sumelectthermalfe: -1282.028495 hartree
dipole: 15.5885 1.4368 -1.9703
dipole: 15.7781
quadrupole: -202.3081 -146.9126 -148.1179
quadrupole: 4.8844 4.8580 6.2510
quadrupole: -36.5286 18.8669 17.6616 4.8844 4.8580 6.2510
hfenergy: -1282.3099472 hartree
pointgroup: C01 [X(C19H19O2S1)]
dipole: 6.1291451 0.56469 -0.7793159 debye
polarizability: 369.2568455|7.3235316|296.3262041|20.1165193|17.2813264|212.2358126 unknown
InChI: InChI=1S/C19H19O2S/c1-10-12-17(3)14-16(2,13(10)20)15(21)18(12,4)19(14,17)22-11-8-6-5-7-9-11/h5-9,12,14H,1-4H3
charge -1 multiplicity 1
41 atoms
C  -0.50943106 0.74400747 -0.98833472
C  -1.09855483 1.19845203 0.36625819
C  -0.5999311 -0.15751252 1.01705257
C  0.07965712 -0.48524753 -0.335721
C  -1.16503291 -0.58144599 -1.21451912
C  -2.41314611 -0.91201727 -0.3782588
C  -1.80685735 -1.07985822 0.99929222
O  -2.17537475 -1.82064391 1.88335683
H  -0.53075961 2.03649758 0.80178026
C  -2.57945851 1.42637752 0.33236693
C  -3.32698215 0.36576937 -0.17880083
O  -4.54522005 0.29156888 -0.45860184
H  -1.05385258 -1.0350854 -2.20328538
C  -3.20450498 -2.10407756 -0.85465765
S  1.48505411 -1.48520284 -0.66436202
C  2.88118292 -0.48466252 -0.2318392
C  2.80047572 0.87537409 0.08858268
C  3.95805622 1.59085602 0.39224185
C  5.2058758 0.96820174 0.3769266
C  5.28669006 -0.38782023 0.05512831
C  4.13611704 -1.11236458 -0.2446335
C  0.169768 -0.11853204 2.30456194
C  -3.17051021 2.78636615 0.52789727
C  -0.00652247 1.62526305 -2.08178773
H  -3.92184693 -2.40876381 -0.07974161
H  -2.54982624 -2.96319896 -1.07497768
H  -3.78111472 -1.84696516 -1.75494317
H  1.8315859 1.3749761 0.10112153
H  3.87777761 2.65212403 0.64294348
H  6.10935061 1.53439257 0.61588908
H  6.25666692 -0.89219951 0.04100932
H  4.20933434 -2.17625325 -0.48841505
H  0.56088684 -1.11618629 2.55983425
H  -0.49149279 0.1971248 3.12731043
H  1.01863797 0.57898927 2.25824247
H  -2.82491421 3.54165917 -0.21086201
H  -4.26563711 2.71705984 0.42439098
H  -2.95812445 3.22407127 1.52380714
H  0.71696604 2.36718358 -1.70692055
H  -0.84325802 2.17570879 -2.54315484
H  0.48637595 1.03975528 -2.87403565
