program: Gaussian 16
title: Title Card Required
version: ES64L-G16RevC.01
method: RPBE1PBE
basis: def2SVP
operation: Freq
keyword: #N
keyword: Geom=AllCheck
keyword: Guess=TCheck
keyword: SCRF=Check
keyword: GenChk
keyword: RPBE1PBE/def2SVPFreq
converged: YES YES NO YES
title: Mulliken charges:
elementType: C C C C C C C O H C C O H C S C C C C C C C C C H H H H H H H H H H H H H H H H H
charge: -0.196393 -0.075673 -0.154218 -0.180584 0.107062 -0.414266 0.186365 -0.255142 -0.025452 -0.281514 0.133215 -0.388428 0.032295 0.061740 0.065498 -0.122124 -0.007282 -0.036278 -0.040592 -0.044642 -0.026727 0.050266 0.002823 0.016822 0.035196 0.023971 0.030812 0.064417 0.044139 0.040800 0.042819 0.032039 0.041826 0.045629 0.066771 0.016001 0.015345 0.013818 0.025445 0.030685 0.023518
chargesum: -1.00000
title: Mulliken charges with hydrogens summed into heavy atoms:
elementType: C C C C C C C O C C O C S C C C C C C C C C
charge: -0.196393 -0.101125 -0.154218 -0.180584 0.139357 -0.414266 0.186365 -0.255142 -0.281514 0.133215 -0.388428 0.151718 0.065498 -0.122124 0.057135 0.007861 0.000208 -0.001823 0.005312 0.204492 0.047988 0.096470
1716.lowfreq: -38.8022 -0.0022 -0.0018 -0.0011 10.7888 24.1469 30.5674 40.8267 53.9118
frequency: 20.7952 37.7898 52.7261 62.2552 73.8580 87.9237 111.9919 140.2531 152.9234 158.2789 180.6615 189.2154 200.7407 212.1333 223.7663 230.2099 244.1987 257.0592 285.8298 305.3224 310.4784 330.8468 365.2035 395.5537 418.3514 421.6223 437.0257 457.5860 492.8808 517.0280 522.4750 529.7359 566.5582 593.3382 625.5709 688.9669 715.4749 727.5532 740.4134 758.5188 769.8702 777.8807 814.0806 844.1002 874.5477 907.5871 919.7308 945.8303 951.5842 977.6297 1011.4059 1014.3300 1014.4904 1024.0131 1025.6267 1032.5417 1034.0743 1040.2018 1043.9088 1048.0862 1058.3621 1105.5825 1107.7560 1121.9324 1135.0343 1157.6602 1185.6698 1193.7189 1198.6660 1200.2303 1252.4879 1276.3495 1322.2773 1333.1108 1341.5227 1350.3358 1361.2213 1382.1700 1390.7779 1395.7777 1411.7617 1423.6194 1430.5587 1430.9858 1436.8114 1443.7873 1448.8597 1450.6539 1456.9691 1469.2189 1477.2807 1517.7100 1653.0582 1656.9632 1668.1667 1690.4480 1719.0338 1831.6263 2986.1800 2994.3228 3009.2044 3039.5090 3044.3426 3044.9286 3054.8175 3116.1681 3126.9415 3129.4424 3132.8087 3139.2046 3162.1804 3170.4441 3191.8178 3202.5325 3210.2068 3217.3008 3227.0798
redmass: 5.3728 5.4154 1.1877 4.8374 3.8549 2.7140 4.3088 3.5871 1.0954 6.3652 2.4073 1.9763 1.8079 1.2481 3.0900 2.0642 3.6337 2.6113 3.9258 4.0126 4.4208 4.6447 4.6907 5.6529 6.2149 3.0793 6.8359 5.2402 3.7174 4.3667 5.2805 4.7146 4.9649 4.1893 6.3644 3.8285 6.1802 1.8978 5.2389 4.1462 1.9335 3.8055 4.5275 3.0769 1.2522 2.1914 1.3711 1.8805 1.3834 2.4617 4.3663 1.7501 1.5111 1.6968 1.8797 2.1923 1.7472 1.4046 1.6351 1.6279 2.5060 1.7074 1.9109 2.8181 3.1416 1.0660 1.7678 2.0182 2.2259 1.1493 1.7261 2.3749 2.5627 1.3998 1.4799 1.5668 1.4470 1.6727 5.3063 2.0015 2.3414 1.9307 1.0855 1.0906 1.0992 1.0707 1.0610 1.0724 1.1876 1.7392 2.4983 2.1951 8.9661 6.6214 6.2102 10.3608 7.7227 12.7736 1.0422 1.0421 1.0840 1.1012 1.0383 1.0380 1.0992 1.0898 1.0998 1.1000 1.1039 1.0971 1.1052 1.1023 1.0917 1.0878 1.0920 1.0966 1.1009
irintensity: 0.7946 2.3631 0.2036 3.1524 0.1818 0.7841 3.3566 1.3705 2.2372 2.1671 5.8031 2.8491 3.1145 2.4530 1.3235 3.6390 3.2336 5.0254 1.7169 7.5199 20.5830 8.5163 3.9857 4.9188 14.4977 3.6777 5.2372 9.5133 15.9427 15.6876 17.7833 7.5195 8.5364 4.7255 1.4870 9.0393 11.0253 52.9740 6.9937 11.6152 49.0090 17.8459 6.4021 3.0872 0.4049 5.8753 14.3143 10.0223 3.2796 2.6658 13.6829 29.3690 21.5351 47.7367 38.5065 23.6448 30.3989 8.2980 1.6944 8.5053 23.3920 13.1982 4.5766 29.0320 1.2615 0.8439 35.0656 33.3785 2.3012 2.3161 2.3438 21.8767 86.3359 15.7208 87.5071 45.8599 7.5049 27.2406 2.5084 17.4389 35.6844 24.4207 31.7456 9.4007 60.3975 8.0790 22.2566 2.7815 1.0688 46.2285 23.7185 50.0064 722.7189 113.3443 42.7665 83.8372 71.0013 688.2476 250.9453 131.4061 60.0093 79.5648 47.9032 37.5073 42.7126 74.2557 42.9315 9.0500 32.1706 10.9455 4.5456 8.4247 38.1934 5.5524 0.5764 10.2192 17.1647
temp: 298.150 k
press: 1.00000 atm
elementType: 6 6 6 6 6 6 6 8 1 6 6 8 1 6 16 6 6 6 6 6 6 6 6 6 1 1 1 1 1 1 1 1 1 1 1 1 1 1 1 1 1
symmnumber: 1
zpe: 864913.4 jmol-1
zpe.correction: 0.329428 hartree
zpe.thermalcorrener: 0.350721 hartree
zpe.thermalcorrenthalpy: 0.351666 hartree
zpe.thermalcorrgfe: 0.279050 hartree
zpe.sumelectzpe: -1282.009182 hartree
zpe.sumelectthermal: -1281.987889 hartree
zpe.sumelectthermalent: -1281.986945 hartree
zpe.sumelectthermalfe: -1282.059561 hartree
dipole: -9.7101 -1.7588 4.4458
dipole: 10.8234
quadrupole: -158.6015 -153.6171 -158.7309
quadrupole: -1.4216 21.3864 -4.3120
quadrupole: -1.6183 3.3661 -1.7477 -1.4216 21.3864 -4.3120
hfenergy: -1282.3386104 hartree
pointgroup: C01 [X(C19H19O2S1)]
dipole: -3.8384402 -0.6628562 1.7483699 debye
polarizability: 339.4365691|-4.2369626|291.6372413|-0.7298487|-18.6167819|305.8109544 unknown
InChI: InChI=1S/C19H19O2S/c1-11-10-12(2)17(20)19(4)15(11)16(13(3)18(19)21)22-14-8-6-5-7-9-14/h5-10,15H,1-4H3
charge -1 multiplicity 1
41 atoms
C  1.17604752 0.848661 1.90932104
C  1.19235775 1.9582743 1.1228328
C  0.28905742 -1.69068971 -0.51787533
C  0.11693659 -1.09733249 0.68555809
C  1.39285748 -0.46992637 1.2285924
C  2.29476941 -0.43289823 -0.0345532
C  1.71495828 -1.53889339 -0.89111133
O  2.29592811 -2.20391902 -1.72365543
H  0.97370913 2.92642827 1.59765923
C  1.50623957 1.98094534 -0.27606509
C  2.08115666 0.8634634 -0.90940574
O  2.50203095 0.80874582 -2.08282039
H  1.84314111 -1.18829613 1.94163958
C  3.78091293 -0.59433054 0.22725104
S  -1.41456491 -1.03372109 1.55562288
C  -2.4856765 -0.26167636 0.36607364
C  -2.02798049 0.76344733 -0.47234606
C  -2.91246592 1.36788473 -1.36259499
C  -4.25360622 0.98112542 -1.40789753
C  -4.70796904 -0.02724769 -0.55851646
C  -3.8273864 -0.65637705 0.32116636
C  -0.67795919 -2.44504194 -1.34925838
C  1.37048388 3.25735649 -1.05619532
C  0.9537531 0.86316645 3.38634775
H  4.31805064 -0.57072697 -0.73109359
H  4.00452779 -1.54989653 0.73017618
H  4.15650802 0.22560129 0.85994487
H  -0.98060922 1.07975847 -0.433855
H  -2.54602918 2.15926171 -2.02195722
H  -4.94209289 1.46443097 -2.10560044
H  -5.75480687 -0.34109634 -0.58796293
H  -4.17935805 -1.46423902 0.96819923
H  -1.45704176 -2.92398978 -0.73728632
H  -0.14163688 -3.20833599 -1.93341918
H  -1.18409202 -1.77734868 -2.06786595
H  1.88462613 4.11397003 -0.5783791
H  1.80961533 3.1145456 -2.0550527
H  0.31816331 3.57384819 -1.19988295
H  0.75095055 1.88225087 3.75283084
H  1.82979221 0.47834946 3.945098
H  0.09894766 0.2274442 3.68482668
