program: Gaussian 16
title: Title Card Required
version: ES64L-G16RevC.01
frameworkgroup: C1[X(C19H19O2S)]
method: RPBE1PBE
basis: def2SVP
operation: Freq
keyword: #P
keyword: Geom=AllCheck
keyword: Guess=TCheck
keyword: SCRF=Check
keyword: GenChk
keyword: RPBE1PBE/def2SVPFreq
converged: YES YES YES YES
title: Mulliken charges:
elementType: C C C C H H C C C C C O O C H H H C H H H C H H H C H H H S C C C C H C H C H H H
charge: 0.075479 -0.378849 -0.321576 0.015207 -0.000013 -0.002677 0.246518 -0.235860 0.038085 -0.034822 -0.177848 -0.300870 -0.419904 0.039306 0.038807 0.037520 0.051084 0.050760 0.021991 0.024759 0.030558 0.039692 0.048703 0.033962 0.041733 0.044560 0.020813 0.020323 0.018205 0.022798 -0.090085 -0.036477 -0.032566 -0.033024 0.045836 -0.043166 0.031151 -0.047563 0.037883 0.041607 0.037960
chargesum: -1.00000
title: Mulliken charges with hydrogens summed into heavy atoms:
elementType: C C C C C C C C C O O C C C C S C C C C C C
charge: 0.075465 -0.378849 -0.321576 0.012530 0.246518 -0.235860 0.038085 -0.034822 -0.177848 -0.300870 -0.419904 0.166716 0.128068 0.164090 0.103900 0.022798 -0.090085 0.009360 -0.001415 0.004859 -0.001559 -0.009603
polarizability: 3.71580227e+02 -2.15282318e+00 3.05756940e+02 2.48148772e-01 -5.77729015e+00 2.36049131e+02
1716.lowfreq: -249.4819 -11.0528 -0.0015 -0.0010 -0.0007 9.2406 20.2021 28.8164 47.3146
frequency: -249.4750 27.9267 47.1053 63.2462 106.7892 124.7486 138.6873 143.1344 154.7231 165.4675 176.7652 193.2650 194.2111 206.3889 221.4282 226.9265 247.2308 265.7072 278.6524 296.0279 323.5800 333.5607 367.5081 416.6403 419.5956 427.1945 437.7740 450.3077 479.3465 500.0995 520.2157 537.3319 559.6313 604.3908 626.3186 643.2440 661.8982 698.0997 711.7643 722.5221 765.1911 766.1857 775.3964 822.2855 854.4562 865.1419 903.0178 931.3548 935.2149 959.1202 983.9915 1006.2134 1007.8460 1009.1916 1011.7613 1017.5004 1025.3327 1028.0447 1039.2587 1045.8376 1056.6003 1077.4357 1099.3715 1106.5660 1117.0383 1148.6352 1155.7400 1183.6013 1201.0993 1212.1069 1229.1947 1257.4563 1284.6721 1309.9204 1317.8190 1348.4828 1358.5951 1366.0959 1376.3891 1390.2896 1390.5527 1414.3327 1417.6532 1428.5608 1428.9700 1433.1532 1433.7190 1444.3895 1457.2917 1462.2094 1476.6936 1510.3343 1568.9753 1654.0726 1668.2463 1702.0079 1731.8075 1799.2324 3006.3959 3027.5997 3032.2407 3034.3453 3043.2201 3078.6103 3101.3835 3117.1037 3124.6549 3138.1337 3146.7297 3147.5203 3155.3592 3160.3355 3196.6059 3200.5934 3208.2664 3214.2774 3225.8574
redmass: 7.3727 4.9244 4.7618 4.0806 4.2702 3.0904 3.9978 3.4854 1.1720 1.2642 1.8844 1.6334 1.1447 3.6392 2.5331 3.0293 2.6412 2.6955 3.3400 3.6675 5.1219 3.7784 5.9546 5.1907 3.0348 5.0137 7.8592 4.4420 4.8136 3.8513 4.4557 4.0629 5.1749 5.3943 6.3495 4.0629 4.1938 3.4052 6.5076 1.7999 1.9355 3.3653 4.4665 3.2435 1.6397 1.2520 2.2914 3.0637 1.4201 3.0187 1.8004 1.4703 2.4204 2.2431 3.3173 1.5045 1.4383 1.5272 1.7613 1.5607 2.3796 1.8006 1.7334 2.5465 3.0418 1.7665 1.0599 1.1199 1.6567 2.2450 2.7485 2.0011 2.5909 2.1667 1.3613 1.6374 1.4009 1.5148 2.5502 3.6893 2.0077 1.9028 1.0617 1.0456 1.0858 1.1361 1.0673 1.0960 1.3647 1.0580 2.5429 2.2885 9.6238 6.5108 6.3279 9.7964 7.8099 12.2100 1.0420 1.0391 1.0396 1.0369 1.0863 1.0982 1.1011 1.0969 1.1039 1.1008 1.1025 1.1036 1.0929 1.1056 1.0875 1.0899 1.0929 1.0967 1.1007
irintensity: 102.4383 0.3265 1.5950 0.3006 0.0947 0.6818 5.1143 2.1417 6.3652 2.5289 2.1846 0.7445 0.2547 1.8107 11.9390 1.7793 7.6556 8.8132 2.8520 29.9312 8.6036 18.6528 21.5647 8.5889 0.3461 3.0969 4.7138 6.1176 7.7441 15.4784 29.7228 24.5759 19.8216 4.1480 2.0541 22.9292 7.9963 22.6902 17.5565 50.1094 82.5703 27.6523 11.9888 44.6024 9.0025 0.7285 3.6499 3.4359 3.8001 43.5504 18.4401 3.0101 34.1949 8.7924 0.8708 16.2924 2.6383 6.9364 6.8963 9.9357 24.7764 16.0268 4.5575 10.0401 28.9500 9.0526 0.2406 3.8919 25.9924 19.5433 12.9412 4.3457 4.1875 3.7088 2.2701 18.7632 17.5665 12.3463 57.4819 6.3180 1.1900 7.1248 24.7986 10.7271 20.5333 8.9988 13.3344 11.1070 16.6520 2.4882 13.1605 80.8267 524.4687 1.2629 78.6274 38.2952 7.1230 853.4063 128.6638 52.8065 31.3494 106.8071 88.0358 34.5910 16.2938 15.9608 34.9768 22.0869 6.2546 18.9538 38.8807 4.3906 4.5129 14.8838 8.4845 11.2259 18.9461
temp: 298.150 k
press: 1.00000 atm
elementType: 6 6 6 6 1 1 6 6 6 6 6 8 8 6 1 1 1 6 1 1 1 6 1 1 1 6 1 1 1 16 6 6 6 6 1 6 1 6 1 1 1
symmnumber: 1
zpe: 860416.1 jmol-1
zpe.correction: 0.327715 hartree
zpe.thermalcorrener: 0.348107 hartree
zpe.thermalcorrenthalpy: 0.349051 hartree
zpe.thermalcorrgfe: 0.279882 hartree
zpe.sumelectzpe: -1281.958460 hartree
zpe.sumelectthermal: -1281.938068 hartree
zpe.sumelectthermalent: -1281.937124 hartree
zpe.sumelectthermalfe: -1282.006293 hartree
dipole: -13.0425 -0.2831 3.7643
dipole: 13.5778
quadrupole: -189.6568 -141.3407 -153.8139
quadrupole: -9.6800 9.2129 2.6210
quadrupole: -28.0530 20.2631 7.7899 -9.6800 9.2129 2.6210
hfenergy: -1282.2861748 hartree
pointgroup: C01 [X(C19H19O2S1)]
dipole: -5.1313615 -0.1043068 1.4813918 debye
polarizability: 371.5791926|-2.167508|305.7111306|0.2561202|-6.0531777|236.0959753 unknown
InChI: InChI=1S/C19H19O2S/c1-11-10-19(4)17(20)12(2)15(11)16(13(3)18(19)21)22-14-8-6-5-7-9-14/h5-10,15H,1-4H3
charge -1 multiplicity 1
41 atoms
C  1.06141987 -1.16891576 0.85366787
C  2.42636011 -0.99835188 0.20026415
C  2.10543619 1.27776222 0.21391565
C  1.1429031 1.20349697 1.34549075
H  0.99069603 -2.12656714 1.39902205
H  0.84376753 2.12605045 1.8580501
C  3.17948428 0.20983447 0.44473097
C  0.02488673 -1.08197878 -0.26510446
C  1.79909991 0.32752217 -1.10619725
C  0.41206944 -0.25300825 -1.25481465
C  0.69607585 0.00165314 1.75546245
O  4.38865067 0.38358638 0.42902709
O  2.461879 0.59241026 -2.13721765
C  -0.37222978 0.1589012 -2.44528309
H  0.31620778 0.2362084 -3.30109472
H  -1.1871259 -0.54697077 -2.66597436
H  -0.82182953 1.15811366 -2.30136984
C  3.12437335 -2.24208811 -0.2360068
H  2.45558576 -2.86353312 -0.85836687
H  4.01505432 -1.98811508 -0.83191145
H  3.45847061 -2.87802485 0.6064269
C  -0.22322152 -0.23243908 2.90660996
H  0.24203798 -0.89806927 3.65547242
H  -0.49712106 0.70810689 3.40802517
H  -1.15006907 -0.7357514 2.58048931
C  2.61614849 2.64514801 -0.14668403
H  3.40413305 2.97654202 0.54947174
H  3.0500289 2.58817886 -1.15722735
H  1.81080593 3.39847812 -0.1451911
S  -1.5573798 -1.83526337 -0.1053709
C  -2.73888682 -0.50945642 -0.07366268
C  -2.3961665 0.81947112 0.1991101
C  -4.08124975 -0.84460266 -0.30166937
C  -3.3887247 1.79717911 0.2403499
H  -1.35090974 1.07959654 0.38383329
C  -5.06589866 0.13963096 -0.25020246
H  -4.35350357 -1.88004175 -0.52549927
C  -4.72602011 1.46633983 0.01832566
H  -3.10808653 2.83233931 0.45328947
H  -6.10889455 -0.13482338 -0.43021294
H  -5.4988753 2.23820399 0.05150523
