program: Gaussian 16
title: Title Card Required
version: ES64L-G16RevC.01
frameworkgroup: C1[X(C19H19O2S)]
method: RPBE1PBE
basis: def2SVP
operation: Freq
keyword: #P
keyword: Geom=AllCheck
keyword: Guess=TCheck
keyword: SCRF=Check
keyword: GenChk
keyword: RPBE1PBE/def2SVPFreq
converged: YES YES YES YES
title: Mulliken charges:
elementType: C C C C H H C C C C C O O C H H H C H H H C H H H C H H H S C C C C H C H C H H H
charge: 0.097051 -0.352303 -0.377568 -0.103445 0.011334 0.010887 0.236313 -0.313997 0.127775 -0.117814 -0.029387 -0.362877 -0.342949 0.034659 0.028555 0.017239 0.026230 0.054814 0.021715 0.024192 0.025454 0.024223 0.049879 0.038158 0.053071 0.079008 0.018980 0.011718 0.019529 0.048064 -0.103950 -0.024842 -0.009380 -0.045598 0.029968 -0.032441 0.053650 -0.043911 0.040447 0.039347 0.038199
chargesum: -1.00000
title: Mulliken charges with hydrogens summed into heavy atoms:
elementType: C C C C C C C C C O O C C C C S C C C C C C
charge: 0.108386 -0.352303 -0.377568 -0.092558 0.236313 -0.313997 0.127775 -0.117814 -0.029387 -0.362877 -0.342949 0.106684 0.126174 0.165332 0.129235 0.048064 -0.103950 0.005126 0.044271 -0.005151 0.006906 -0.005712
polarizability: 3.62074222e+02 -6.72007326e+00 3.09403992e+02 1.04834122e+01 -3.06420562e+00 2.76864629e+02
1716.lowfreq: -341.6408 -18.7722 -9.3081 -0.0023 -0.0022 -0.0015 5.9774 32.8762 43.4205
frequency: -341.6403 31.7471 43.2569 68.0238 93.1905 111.1802 120.9939 135.0187 154.2370 181.1814 192.0798 195.8347 205.6750 216.0530 219.9298 247.7656 267.5833 274.4330 285.1725 304.1904 334.7186 347.0498 358.2890 379.4969 418.9404 422.2404 435.0224 457.3002 480.1263 491.6209 511.0895 525.8981 546.9621 590.0505 625.1217 661.3244 684.4879 716.0279 723.7423 743.8053 769.0654 775.9724 822.1929 853.9759 868.6962 869.5622 909.1780 921.7032 944.0851 953.9661 991.2510 1009.4480 1012.0682 1017.2867 1026.8504 1031.5972 1035.4551 1037.9639 1041.6735 1055.9140 1058.6095 1100.6973 1115.6035 1120.2907 1125.1156 1146.7467 1156.8915 1171.0509 1182.8104 1211.8707 1235.1018 1277.3660 1311.2756 1317.1531 1326.0274 1359.8116 1369.9961 1372.9185 1385.6850 1390.9126 1415.8861 1427.6537 1429.8023 1433.6756 1438.7353 1441.3656 1445.1484 1447.9816 1449.9225 1469.5383 1477.4652 1505.4155 1511.0395 1655.9059 1659.3813 1668.6427 1713.0310 1755.0632 2996.2183 3007.5418 3029.5443 3062.2808 3062.8090 3091.7830 3103.0892 3118.0258 3141.7925 3144.7408 3150.3705 3158.0806 3167.2262 3185.6453 3198.9698 3206.2452 3214.0503 3223.8752 3227.8385
redmass: 8.5741 5.1117 5.2886 3.9108 5.0346 3.3490 6.0097 3.8846 1.2654 1.3058 1.6125 1.3235 3.4277 1.3108 2.3644 2.9647 3.7125 2.6522 3.3830 2.8163 3.0820 5.2059 4.0649 5.3322 3.6182 4.8532 6.5748 5.5703 5.3876 4.1654 4.6485 4.0599 5.9294 4.5363 6.3601 4.4689 4.6477 6.1521 1.8921 4.8828 1.7524 2.7519 5.7576 2.9104 1.4524 1.3458 2.1671 2.9748 1.3787 1.7375 1.9471 1.7237 3.0234 1.8272 1.9090 1.3494 1.3900 1.4207 2.1403 2.3372 1.9389 1.4899 2.5570 2.7967 2.4159 1.7632 1.0615 1.7221 1.1218 2.7655 2.1943 3.6404 1.8430 1.3688 2.3085 1.3962 1.4517 1.4323 1.7588 6.8173 2.2566 1.1126 1.1131 1.0456 1.4567 1.0503 1.1705 1.2924 1.2317 1.6269 2.5722 3.6407 2.3449 6.6679 10.7308 6.6201 11.3775 8.0014 1.0426 1.0483 1.0390 1.0979 1.0390 1.0886 1.1018 1.0890 1.0997 1.1037 1.1032 1.1015 1.0930 1.1036 1.0872 1.0897 1.0946 1.0962 1.0997
irintensity: 582.3903 2.1403 5.5931 2.1277 0.9753 1.4723 7.0827 0.9053 0.1387 3.0244 11.6406 4.4247 4.8862 1.4634 5.1500 5.1248 2.1967 2.9106 1.0304 2.4867 9.2154 4.9334 20.1964 9.8731 1.2263 0.7743 6.2958 7.8566 1.7043 5.5430 9.6729 48.4261 22.5085 19.9319 2.1176 4.3642 28.8414 13.1165 46.6674 7.7364 43.4432 9.5890 6.3762 64.7932 5.8938 5.2843 5.3691 22.6997 2.1967 25.2556 31.5416 0.0686 2.4712 14.3155 37.7893 0.7060 23.1146 1.0171 23.9544 22.3730 11.6418 6.9627 6.8342 20.7351 4.3534 2.6117 0.0977 11.9065 5.6646 2.6490 6.4879 49.8099 21.5583 1.3716 41.2415 4.7121 20.9907 49.2439 26.6546 3.3031 107.2166 65.5401 4.3811 12.8466 30.1633 4.0698 23.0205 35.6498 46.2481 131.5964 43.1225 174.0437 54.1807 23.3615 660.5237 124.0563 845.5424 18.0523 202.4001 111.0675 56.6974 26.8821 56.2063 36.2744 19.6453 23.8268 8.4789 13.1342 24.4345 22.3136 36.7949 18.1865 0.7718 1.9467 17.0210 0.3753 31.2531
temp: 298.150 k
press: 1.00000 atm
elementType: 6 6 6 6 1 1 6 6 6 6 6 8 8 6 1 1 1 6 1 1 1 6 1 1 1 6 1 1 1 16 6 6 6 6 1 6 1 6 1 1 1
symmnumber: 1
zpe: 863228.2 jmol-1
zpe.correction: 0.328786 hartree
zpe.thermalcorrener: 0.349060 hartree
zpe.thermalcorrenthalpy: 0.350004 hartree
zpe.thermalcorrgfe: 0.281049 hartree
zpe.sumelectzpe: -1281.978820 hartree
zpe.sumelectthermal: -1281.958546 hartree
zpe.sumelectthermalent: -1281.957602 hartree
zpe.sumelectthermalfe: -1282.026558 hartree
dipole: -4.4765 6.3500 0.3815
dipole: 7.7786
quadrupole: -141.9742 -153.1975 -164.7663
quadrupole: 13.4038 1.7704 -3.0287
quadrupole: 11.3385 0.1152 -11.4536 13.4038 1.7704 -3.0287
hfenergy: -1282.3076064 hartree
pointgroup: C01[X(C19H19O2S1)]
dipole: -1.7612023 2.4982762 0.1501105 debye
polarizability: 362.0742226|-6.72007|309.4039915|10.4834124|-3.064205|276.864629 unknown
InChI: InChI=1S/C19H19O2S/c1-11-10-19(4)17(20)12(2)15(11)16(13(3)18(19)21)22-14-8-6-5-7-9-14/h5-10,15H,1-4H3
charge -1 multiplicity 1
41 atoms
C  1.388031 1.489651 0.46208
C  0.914752 0.465522 1.469497
C  2.260753 -1.113407 0.058495
C  3.195153 0.049329 -0.196547
H  1.174731 2.516986 0.787233
H  4.188165 -0.178676 -0.602162
C  1.38152 -0.859961 1.304351
C  0.289864 0.919458 -0.390766
C  1.379606 -1.14092 -1.23793
C  0.410711 -0.099143 -1.373564
C  2.782411 1.31457 -0.041817
O  1.089784 -1.813519 2.046426
O  1.554823 -2.042785 -2.065991
C  -0.574414 -0.256507 -2.49683
H  -1.407511 -0.950675 -2.273092
H  -1.026015 0.703894 -2.788817
H  -0.047764 -0.679351 -3.366991
C  0.081958 0.857959 2.639691
H  -0.852143 1.37258 2.350412
H  -0.180842 -0.047425 3.207514
H  0.620594 1.547897 3.318694
C  3.578576 2.527938 -0.392151
H  3.698642 3.199186 0.476213
H  4.579897 2.265439 -0.765075
H  3.067958 3.118127 -1.174088
C  3.01722 -2.420159 0.198436
H  3.553055 -2.648051 -0.733105
H  3.738457 -2.363374 1.028805
H  2.322428 -3.242415 0.412024
S  -1.211637 1.849818 -0.281822
C  -2.4696 0.616405 -0.079582
C  -3.776563 0.954388 -0.451295
C  -2.206103 -0.638669 0.482316
C  -4.814608 0.044648 -0.2557
H  -3.979929 1.930168 -0.901366
C  -3.249889 -1.544011 0.660157
H  -1.186664 -0.901485 0.772653
C  -4.555843 -1.209754 0.296582
H  -5.831743 0.317635 -0.549461
H  -3.035079 -2.524328 1.093944
H  -5.368115 -1.926803 0.439794
