program: Gaussian 16
title: Title Card Required
version: ES64L-G16RevC.01
frameworkgroup: C1[X(C19H19O2S)]
method: RPBE1PBE
basis: def2SVP
operation: Freq
keyword: #P
keyword: Geom=AllCheck
keyword: Guess=TCheck
keyword: SCRF=Check
keyword: GenChk
keyword: RPBE1PBE/def2SVPFreq
converged: YES YES YES YES
title: Mulliken charges:
elementType: C C C C C C C C C O C C O C C H H H H H H H H H H H H H H S C C C C H C H C H H H
charge: -0.080445 0.075049 -0.407100 0.076890 -0.070270 0.017794 -0.166217 -0.284747 0.208006 -0.386624 0.052444 -0.075382 -0.320941 0.034080 0.025455 -0.015489 0.050797 0.049185 0.041988 0.028793 0.023573 0.034807 0.017489 0.015535 0.015056 0.051418 0.036394 0.050923 0.005260 -0.003892 -0.077587 -0.034232 -0.029777 -0.046208 0.028696 -0.040733 0.035007 -0.048623 0.039240 0.038922 0.035464
chargesum: -1.00000
title: Mulliken charges with hydrogens summed into heavy atoms:
elementType: C C C C C C C C C O C C O C C S C C C C C C
charge: -0.080445 0.059561 -0.407100 0.076890 -0.070270 0.159764 -0.166217 -0.284747 0.208006 -0.386624 0.139617 -0.070122 -0.320941 0.082161 0.164190 -0.003892 -0.077587 -0.005535 0.005230 -0.006969 -0.001811 -0.013159
polarizability: 3.99219784e+02 2.85148197e+00 2.95727071e+02 2.67115721e+01 -5.71342991e+00 2.50304075e+02
1716.lowfreq: -9.6776 0.0003 0.0014 0.0021 7.4894 10.3862 23.4973 47.6628 49.8710
frequency: 22.9194 47.6311 49.6712 91.4459 109.9172 113.9699 122.3434 140.3439 154.4075 176.3152 192.0882 199.5415 214.8113 230.7662 248.9726 274.1750 276.1824 287.7129 314.6719 337.8859 352.5796 373.1047 376.0609 407.5029 415.0480 418.3852 434.2976 447.9993 489.4529 492.0413 527.6709 545.4038 569.1516 622.6593 628.0348 666.1287 693.5892 712.7639 718.9632 721.8026 763.2486 767.3178 794.2639 814.2237 855.4040 865.3433 916.0448 931.8873 942.6286 972.6015 989.7641 1001.8690 1011.1323 1012.5749 1023.7149 1026.9239 1032.6894 1040.4943 1046.8674 1049.9461 1057.3894 1106.2557 1109.0723 1118.8953 1143.4231 1156.4008 1167.3347 1172.0778 1191.5850 1199.2831 1223.0720 1267.0055 1287.7200 1310.4138 1325.9425 1349.8917 1370.0659 1372.4140 1378.4940 1390.8914 1406.4775 1419.2066 1432.9966 1436.9534 1437.7343 1439.0959 1441.8784 1444.3155 1453.5681 1476.7736 1479.0696 1513.3837 1641.8163 1653.9906 1655.4856 1668.7993 1715.0306 1763.6743 2977.8910 3031.1718 3040.2155 3051.4402 3065.2956 3105.6591 3111.4070 3133.1792 3135.3607 3148.5912 3151.4494 3164.0617 3185.1403 3193.7632 3194.3426 3197.3023 3204.0777 3211.3599 3224.5830
redmass: 4.9676 4.5583 4.1671 3.5325 4.5967 1.9694 1.9587 3.4846 4.0877 3.4949 1.1473 1.0503 2.0774 1.6894 2.7676 3.6774 2.9751 2.9636 3.2873 4.6978 4.1150 3.2844 3.9636 5.1012 4.6937 3.8248 7.4339 6.0036 3.6281 4.2547 4.3252 4.3379 5.3738 5.7222 5.8952 3.8225 4.5647 6.1161 4.9396 1.9128 1.8215 2.7710 5.0061 3.5057 1.5806 1.2571 1.9680 1.4654 1.7870 2.5514 2.3225 1.8472 2.4158 2.0498 1.6677 1.4136 1.5515 1.5838 1.8662 1.6063 2.4731 1.5827 3.2060 2.8837 2.4274 1.0605 2.1256 1.6258 1.1332 2.4090 2.3817 3.3351 2.0629 2.5205 1.3826 1.4452 1.4434 1.5199 1.4433 5.7178 2.4391 1.0506 1.0442 1.0518 1.1104 1.0823 1.1418 1.2696 1.0492 2.5423 2.3161 2.2331 9.2965 6.8952 9.4399 6.4417 11.0627 8.0486 1.0431 1.0388 1.0983 1.0428 1.0394 1.1016 1.0880 1.0983 1.0956 1.1036 1.1027 1.0931 1.0925 1.1042 1.0887 1.1017 1.0909 1.0958 1.1003
irintensity: 2.2844 2.2525 1.4776 3.7649 2.4886 1.5628 1.2791 5.7070 3.5908 0.2713 0.6528 1.2071 1.4666 1.5981 1.5778 0.8181 3.2953 1.1015 14.1929 32.6565 16.3646 21.2705 31.0455 2.4228 5.6043 7.6976 2.1683 3.2528 10.0423 2.0509 2.7634 7.6955 1.7545 14.5427 10.8405 31.9370 28.0348 14.1970 42.0064 36.2630 44.5619 15.9282 0.9685 12.0534 21.3090 3.8298 2.9195 9.7532 4.8597 26.9862 9.4107 1.7625 5.0775 24.3308 9.8003 3.1294 5.8297 17.7920 11.3092 6.7820 28.2347 12.1392 9.7383 31.2099 17.9006 1.1228 10.3477 10.2502 2.0747 13.6087 10.6027 10.5663 10.4048 18.2548 1.6993 31.7161 55.0608 9.3387 3.4574 4.3595 18.5599 10.9095 11.6313 12.8872 16.2410 13.4491 1.8684 23.5236 9.0998 11.8474 21.1424 72.2922 121.3005 178.4720 810.9222 260.7700 192.4690 3.6024 160.8470 51.6340 85.2183 33.4216 39.3579 16.5539 60.6688 14.7041 10.8355 25.2688 25.6837 35.8096 50.5599 4.4196 5.3690 12.0134 4.2155 14.7057 22.3110
temp: 298.150 k
press: 1.00000 atm
elementType: 6 6 6 6 6 6 6 6 6 8 6 6 8 6 6 1 1 1 1 1 1 1 1 1 1 1 1 1 1 16 6 6 6 6 1 6 1 6 1 1 1
symmnumber: 1
zpe: 865985.8 jmol-1
zpe.correction: 0.329837 hartree
zpe.thermalcorrener: 0.350525 hartree
zpe.thermalcorrenthalpy: 0.351470 hartree
zpe.thermalcorrgfe: 0.281146 hartree
zpe.sumelectzpe: -1281.985605 hartree
zpe.sumelectthermal: -1281.964916 hartree
zpe.sumelectthermalent: -1281.963971 hartree
zpe.sumelectthermalfe: -1282.034295 hartree
dipole: -4.3473 -5.5083 -1.1434
dipole: 7.1097
quadrupole: -149.9966 -153.5856 -157.7681
quadrupole: -8.8683 -9.1453 4.4069
quadrupole: 3.7868 0.1978 -3.9847 -8.8683 -9.1453 4.4069
hfenergy: -1282.3154411 hartree
pointgroup: C01 [X(C19H19O2S1)]
dipole: -1.7103311 -2.1673226 -0.4491019 debye
polarizability: 399.2170691|2.8621565|295.7226135|26.7180268|-5.730976|250.3112473 unknown
InChI: InChI=1S/C19H19O2S/c1-11-10-19(4)17(21)12(2)15(11)16(20)13(3)18(19)22-14-8-6-5-7-9-14/h5-10,15H,1-4H3
charge -1 multiplicity 1
41 atoms
C  3.00189768 -0.84167976 -0.90271751
C  3.03622556 0.180038 0.1874734
C  2.30582444 1.46599139 -0.1258954
C  2.16822722 -0.08273193 1.40287199
C  0.78871955 -0.67231151 1.24147485
C  0.2707247 -1.23705897 2.52790096
C  0.10678244 -0.71711485 0.06160876
C  0.66534424 -0.07829423 -1.21480706
C  1.09104344 1.37458192 -0.80894545
O  0.28829064 2.30176701 -1.05007904
C  -0.31385337 -0.01805002 -2.37749499
C  1.86604968 -0.92003518 -1.60454111
O  2.56798389 0.2287679 2.5264462
C  2.69307194 2.70828157 0.59792335
C  4.20211466 -1.70428991 -1.11716721
H  4.05641821 0.36320035 0.55282829
H  0.45773156 -0.50869387 3.33061133
H  0.81984224 -2.15224968 2.8100457
H  -0.79704947 -1.47913803 2.47205766
H  -0.67129847 -1.02194636 -2.64905967
H  0.19547832 0.41544591 -3.2523139
H  -1.17287761 0.62270502 -2.14791
H  2.69217424 2.55612676 1.69745007
H  1.9693355 3.50319483 0.35950629
H  3.70577007 3.0703265 0.33572932
H  5.09128313 -1.09971694 -1.36813452
H  4.043348 -2.43461013 -1.92487175
H  4.45517926 -2.26081542 -0.19750231
H  1.73886636 -1.64864806 -2.41409917
S  -1.36041973 -1.72011198 -0.03940086
C  -2.70516152 -0.56509728 0.02438279
C  -3.99843925 -1.10973056 0.00699593
C  -2.54085401 0.82236594 0.1111553
C  -5.11090414 -0.27576346 0.08083476
H  -4.13141768 -2.1936529 -0.05984302
C  -3.6644829 1.64585518 0.18178352
H  -1.54206558 1.26885097 0.0827977
C  -4.95146221 1.10830093 0.17094454
H  -6.11239348 -0.71469547 0.06853741
H  -3.52309411 2.72867853 0.24149998
H  -5.82498544 1.76242782 0.22883389
