program: Gaussian 16
title: Title Card Required
version: ES64L-G16RevC.01
method: RPBE1PBE
basis: def2SVP
operation: Freq
keyword: #N
keyword: Geom=AllCheck
keyword: Guess=TCheck
keyword: SCRF=Check
keyword: GenChk
keyword: RPBE1PBE/def2SVP
keyword: Freq
converged: YES YES YES YES
title: Mulliken charges:
elementType: C C C C H H C C C C C O O C H H H C H H H C H H H H C H H H
charge: 0.021914 -0.241757 -0.341232 -0.008423 -0.001911 -0.007585 0.260533 -0.216237 0.039295 -0.093204 -0.166306 -0.306249 -0.430946 0.027436 0.030242 0.027102 0.040802 0.029771 0.047485 0.034428 0.036890 0.038909 0.016450 0.016158 0.015703 -0.012713 0.017323 0.054316 0.036167 0.035639
chargesum: -1.00000
title: Mulliken charges with hydrogens summed into heavy atoms:
elementType: C C C C C C C C C O O C C C C
charge: 0.020003 -0.254470 -0.341232 -0.016008 0.260533 -0.216237 0.039295 -0.093204 -0.166306 -0.306249 -0.430946 0.125582 0.148575 0.087220 0.143445
1716.lowfreq: -326.8298 -24.8415 0.0003 0.0007 0.0009 7.4466 19.7334 100.1831 110.6063
frequency: -326.8257 100.1028 110.5688 128.2753 141.8375 154.0090 166.3384 187.1278 192.5624 234.7160 261.0937 284.1913 293.3910 305.1009 335.9254 391.5515 401.5003 429.3189 445.5541 499.8635 516.6865 521.1845 611.5144 613.2896 644.1185 645.2215 701.5297 768.6556 787.1484 824.2813 853.4905 873.8873 907.4072 951.2597 957.3950 972.5836 1010.3977 1013.6719 1040.5034 1041.3412 1052.1799 1075.6840 1120.8159 1136.1903 1174.0678 1199.9466 1213.0853 1223.1538 1258.9435 1299.0265 1309.9092 1342.4313 1357.5860 1372.9098 1376.4105 1384.1386 1396.2673 1418.2943 1427.7728 1430.5608 1435.9913 1442.9432 1444.5816 1445.2173 1459.9869 1570.0444 1729.6047 1770.4309 1810.6348 3026.1636 3026.4107 3027.1543 3028.1219 3036.3393 3096.4098 3098.2165 3108.3653 3120.5553 3125.4466 3131.3313 3142.8531 3143.8748 3150.2604 3153.0189
redmass: 5.0596 2.9274 1.4924 3.1875 1.9230 1.3170 1.1966 1.1075 1.7026 2.8886 2.5654 2.6015 3.4795 3.8931 3.6193 4.3874 4.3181 5.3850 4.2361 4.6575 3.9917 4.0908 4.3434 3.5183 3.6261 3.8073 3.5150 3.2086 2.9321 2.1869 1.9644 2.0619 2.2106 2.2510 1.5993 1.9501 1.4803 1.5406 1.5923 1.6517 1.7004 1.7989 2.5371 1.9643 2.1362 2.0711 1.9215 2.4484 2.0592 2.0580 2.3641 1.6147 2.0556 1.5161 2.7502 1.5776 1.7533 1.0462 1.0986 1.0525 1.0608 1.0510 1.0673 1.0667 1.0563 9.5487 7.8461 9.1903 11.7214 1.0405 1.0371 1.0395 1.0413 1.0840 1.1014 1.1006 1.0957 1.1035 1.0896 1.1034 1.1028 1.1016 1.0928 1.1047
irintensity: 129.7023 0.2383 2.0665 2.5874 2.9622 3.6716 1.7950 0.9375 0.6300 0.9272 3.6021 3.6211 12.7631 6.4927 13.6380 6.5585 1.7680 3.7480 14.1095 8.7160 25.6362 26.7594 19.0307 6.4278 22.7182 21.8093 3.2710 53.2922 15.1837 1.3353 25.0111 18.4985 40.1247 17.0432 13.7842 53.3918 8.9598 10.1597 12.4534 11.7032 14.0533 18.9813 20.8123 6.3129 13.5904 32.7249 25.1030 21.7173 9.0184 3.6382 0.6121 30.3522 14.8038 20.0190 52.1594 3.1865 0.4415 21.6563 20.3847 2.6742 11.3004 15.5272 13.1690 1.6300 3.3643 561.5353 9.1639 17.4276 761.4797 47.4388 156.5863 50.5102 63.3165 122.9180 27.5471 26.8438 27.1860 32.1078 76.6503 9.9040 27.4299 20.6922 45.5583 16.5290
temp: 298.150 k
press: 1.00000 atm
elementType: 6 6 6 6 1 1 6 6 6 6 6 8 8 6 1 1 1 6 1 1 1 6 1 1 1 1 6 1 1 1
symmnumber: 1
zpe: 642466.0 jmol-1
zpe.correction: 0.244702 hartree
zpe.thermalcorrener: 0.258874 hartree
zpe.thermalcorrenthalpy: 0.259819 hartree
zpe.thermalcorrgfe: 0.205511 hartree
zpe.sumelectzpe: -653.457515 hartree
zpe.sumelectthermal: -653.443343 hartree
zpe.sumelectthermalent: -653.442399 hartree
zpe.sumelectthermalfe: -653.496707 hartree
dipole: 8.3746 1.7762 -0.7868
dipole: 8.5969
quadrupole: -108.4320 -105.9877 -94.2201
quadrupole: -1.7789 1.6804 0.8763
quadrupole: -5.5521 -3.1078 8.6599 -1.7789 1.6804 0.8763
hfenergy: -653.7022176 hartree
pointgroup: C01 [X(C13H15O2)]
dipole: 3.8351555 1.1426212 -0.6150611 debye
polarizability: 213.9241981|2.0445585|185.9100926|25.9035175|2.4936025|176.2871536 unknown
InChI: InChI=1S/C13H15O2/c1-7-6-13(4)11(14)5-10(7)8(2)9(3)12(13)15/h5-6,10H,1-4H3
charge -1 multiplicity 1
30 atoms
C  1.34893718 -0.05078783 0.8907425
C  -0.07873678 -0.49831987 1.18615573
C  -0.52056082 -0.54554676 -1.05044632
C  0.91318891 -0.75532832 -1.39119465
H  2.0402924 -0.30984041 1.71276169
H  1.18254337 -1.0669631 -2.40835477
C  -0.78891186 -1.32450937 0.23970257
C  1.33455619 1.45271082 0.62786599
C  -0.88670271 0.74241585 -0.05067632
C  0.16361384 1.82704609 0.08516171
C  1.84857791 -0.62792658 -0.43126063
O  -1.65215286 -2.1698961 0.41452552
O  -2.10310335 1.04716212 -0.0034996
C  -0.20753531 3.16104511 -0.46412257
H  -1.25034777 3.38140079 -0.1855317
H  0.44999519 3.97042948 -0.11268537
H  -0.17338264 3.15877007 -1.56961129
C  3.30269681 -0.91819206 -0.60329347
H  3.63068286 -1.71213836 0.09172301
H  3.53349093 -1.24935657 -1.62749244
H  3.9318814 -0.0390507 -0.37976769
C  -1.51908145 -0.75189788 -2.15397516
H  -1.75424946 -1.82087786 -2.29066179
H  -2.44640838 -0.23102112 -1.86447202
H  -1.16535089 -0.34641631 -3.11661476
H  -0.34573329 -0.58975925 2.24914644
C  2.56568497 2.27888041 0.79422758
H  3.31966798 2.06297831 0.01587142
H  2.34858565 3.35618278 0.73871319
H  3.05355388 2.0787263 1.7642532
