program: Gaussian 16
title: Title Card Required
version: ES64L-G16RevC.01
method: RPBE1PBE
basis: def2SVP
operation: Freq
keyword: #P
keyword: Geom=AllCheck
keyword: Guess=TCheck
keyword: SCRF=Check
keyword: GenChk
keyword: RPBE1PBE/def2SVP
keyword: Freq
converged: YES YES YES YES
title: Mulliken charges:
elementType: C C C C C C O C C C O H H C C C C H H H H H H H H H H H H H
charge: -0.092381 -0.134604 0.066432 -0.002006 -0.422613 0.127277 -0.411925 0.101169 -0.164638 -0.176691 -0.321848 -0.024574 -0.025685 0.021324 0.004844 0.023154 0.009089 0.008220 0.048815 0.033878 0.050758 0.031817 0.039599 0.042025 0.009019 0.006751 0.009918 0.036715 0.049624 0.056538
chargesum: -1.00000
title: Mulliken charges with hydrogens summed into heavy atoms:
elementType: C C C C C C O C C C O C C C C
charge: -0.092381 -0.126384 0.040747 -0.026580 -0.422613 0.127277 -0.411925 0.101169 -0.164638 -0.176691 -0.321848 0.154775 0.118286 0.048842 0.151966
polarizability: 1.93660287e+02 5.70687289e+00 2.10922934e+02 1.53872128e+01 2.43727425e+01 1.84737654e+02
1716.lowfreq: -19.4833 0.0005 0.0009 0.0013 17.3057 18.6851 70.9113 86.4555 99.2419
frequency: 70.8408 86.4479 99.2100 110.5243 124.5788 130.0872 165.3950 180.2185 201.5743 240.8484 265.4782 291.1085 325.2924 341.6461 347.1113 377.4005 401.3509 416.0100 460.8678 492.8982 514.9668 551.2875 581.6370 651.1136 711.3419 729.0479 753.8722 772.2903 801.4002 837.5840 894.5544 931.2918 946.6491 986.0864 992.0206 1015.8438 1042.9609 1048.3242 1050.5442 1068.1712 1072.8358 1097.3038 1132.7414 1174.8968 1184.5239 1195.8594 1246.6620 1261.4615 1276.9179 1304.0227 1339.2003 1346.2940 1361.9502 1381.6015 1389.7219 1398.6531 1425.8917 1433.2319 1433.6921 1436.5448 1440.0997 1441.5623 1444.3662 1452.1882 1476.1394 1682.6443 1713.3051 1725.8922 1759.8120 2963.7562 3015.9249 3028.3364 3035.5129 3045.4011 3094.3674 3102.2445 3103.1289 3104.5230 3118.5875 3127.8774 3144.7461 3172.1163 3173.1551 3184.8236
redmass: 1.7393 1.6553 3.2508 2.8278 4.6422 4.6942 1.0500 1.0348 1.0966 2.5990 2.8508 3.5651 3.6196 4.2378 3.9712 2.6626 4.5711 5.6275 4.8207 4.4029 3.9623 4.2399 5.2469 3.0636 3.8465 5.4593 4.3541 4.2636 4.5178 1.4722 2.2761 1.7594 2.5196 1.6305 1.5000 1.4911 1.4073 1.5979 1.5949 1.6470 2.9500 2.4932 3.5318 2.1355 1.5327 2.0584 1.8803 2.3895 1.7298 1.9813 1.6129 1.4106 1.7286 1.2692 2.2206 2.0759 1.0478 1.0879 1.0514 1.0464 1.0621 1.0814 1.4433 1.0712 2.0906 10.2696 8.2644 10.5078 7.6794 1.0432 1.0986 1.0387 1.0414 1.0458 1.0874 1.1015 1.0873 1.1007 1.0971 1.0938 1.1036 1.0939 1.1024 1.1002
irintensity: 3.9284 1.7027 4.9753 1.3027 0.2685 3.5297 0.5715 0.6966 0.1392 7.6013 4.5816 1.5083 13.1057 42.1602 17.9219 1.9915 5.7121 12.4614 8.2787 9.8421 4.7345 6.7365 3.9059 18.8625 30.8145 32.8402 5.2141 13.8162 3.0989 37.0569 12.2763 4.3880 21.8236 4.0425 1.8418 2.8603 8.1095 5.2793 3.3522 10.5658 40.2400 21.8002 14.5183 15.1618 17.4014 2.1536 14.2595 1.2247 0.6292 14.1828 19.8426 24.3642 16.5449 4.1358 35.2988 11.8299 11.2902 6.0965 16.9035 11.0569 14.4161 13.3861 26.9474 10.0247 8.1285 1103.9264 167.5176 184.0415 2.5287 196.1538 99.1447 56.0690 39.6746 54.6977 72.7579 21.8875 48.9656 13.3754 21.8459 18.1894 28.5021 43.0581 14.8374 27.0113
temp: 298.150 k
press: 1.00000 atm
elementType: 6 6 6 6 6 6 8 6 6 6 8 1 1 6 6 6 6 1 1 1 1 1 1 1 1 1 1 1 1 1
symmnumber: 1
zpe: 648701.3 jmol-1
zpe.correction: 0.247077 hartree
zpe.thermalcorrener: 0.261903 hartree
zpe.thermalcorrenthalpy: 0.262847 hartree
zpe.thermalcorrgfe: 0.206346 hartree
zpe.sumelectzpe: -653.493940 hartree
zpe.sumelectthermal: -653.479114 hartree
zpe.sumelectthermalent: -653.478170 hartree
zpe.sumelectthermalfe: -653.534671 hartree
dipole: 4.2181 -4.2412 5.5079
dipole: 8.1313
quadrupole: -97.3647 -116.6474 -100.9435
quadrupole: 10.1293 -1.8093 -0.8982
quadrupole: 7.6205 -11.6622 4.0417 10.1293 -1.8093 -0.8982
hfenergy: -653.741017 hartree
pointgroup: C01 [X(C13H15O2)]
dipole: 1.4693878 -1.5430453 2.229722 debye
polarizability: 193.6602865|5.7068729|210.9229336|15.3872128|24.3727425|184.7376536 unknown
InChI: InChI=1S/C13H15O2/c1-6-5-10-7(2)8(3)13(15)11(6)9(4)12(10)14/h5,10-11H,1-4H3
charge -1 multiplicity 1
30 atoms
C  -1.17547748 -0.80235648 1.41021224
C  -0.58602743 0.26704193 1.95839759
C  -1.22377425 -0.82357266 -0.09160938
C  0.06032901 1.26735836 1.03204169
C  -1.52207607 0.531278 -0.71158115
C  -0.86325762 1.63337138 -0.17062834
O  -0.86738961 2.824254 -0.55330098
C  0.09492423 -1.06153179 -0.80154709
C  1.35006597 -0.37314546 -0.34349496
C  1.3596305 0.6762898 0.52040936
O  0.1277766 -1.78274955 -1.79950368
H  0.27684268 2.20881097 1.55660281
H  -1.91830759 -1.59352149 -0.45921575
C  -1.77324339 -1.94211747 2.16725817
C  2.58670941 -0.98113754 -0.94188944
C  -2.16122087 0.58062424 -2.05695549
C  2.59532036 1.32550873 1.05954893
H  -0.49942338 0.39377779 3.04363976
H  -1.30374258 -2.89832788 1.87556494
H  -1.65450011 -1.82202924 3.25498012
H  -2.85055065 -2.04767441 1.94797652
H  3.48554537 -0.37156762 -0.78673908
H  2.78350245 -1.9878237 -0.53199538
H  2.43587487 -1.12017255 -2.02267547
H  -2.18154868 1.62728717 -2.4015423
H  -3.20096407 0.19635485 -2.07183065
H  -1.60530451 -0.01440891 -2.81267762
H  3.53176094 0.86367346 0.72209272
H  2.58465667 1.29758208 2.16346163
H  2.61509023 2.39421597 0.78208128
