program: Gaussian 16
title: Title Card Required
version: ES64L-G16RevA.03
frameworkgroup: C1[X(C13H15O2)]
method: RPBE1PBE
basis: def2SVP
operation: Freq
keyword: #N
keyword: Geom=AllCheck
keyword: Guess=TCheck
keyword: SCRF=Check
keyword: GenChk
keyword: RPBE1PBE/def2SVPFreq
converged: YES YES NO YES
title: Mulliken charges:
elementType: C C C C H H C C H C C C O O C H H H C H H H C H H H C H H H
charge: 0.078226 -0.414193 -0.386845 -0.111461 0.002138 0.008107 0.222035 -0.104141 0.031438 0.136757 -0.172408 -0.039171 -0.371723 -0.335364 0.009084 0.025382 0.017347 0.028056 0.039316 0.018503 0.020598 0.020114 0.021926 0.048627 0.036436 0.050050 0.080732 0.008702 0.016856 0.014877
chargesum: -1.00000
title: Mulliken charges with hydrogens summed into heavy atoms:
elementType: C C C C C C C C C O O C C C C
charge: 0.080364 -0.414193 -0.386845 -0.103354 0.222035 -0.072703 0.136757 -0.172408 -0.039171 -0.371723 -0.335364 0.079869 0.098531 0.157039 0.121166
1716.lowfreq: -365.9190 -22.0256 -0.0007 0.0004 0.0009 10.9565 21.9416 94.6689 100.6476
frequency: -365.9171 94.6151 100.3501 113.0482 122.4372 134.3961 137.2826 189.3196 207.9258 235.0557 243.9955 270.2659 272.3511 318.5066 345.1361 350.7774 378.2051 402.8987 432.5962 444.7902 496.8828 524.9776 584.7120 630.0235 674.2473 734.8944 745.1500 793.4335 821.8075 861.3315 875.1586 897.2521 909.3588 942.2544 974.5232 1012.8401 1025.3000 1030.9996 1039.7512 1045.2620 1053.2179 1098.7312 1122.8222 1154.5545 1171.6751 1204.5470 1222.0764 1254.2210 1271.3480 1311.2377 1346.9994 1371.1667 1372.5700 1381.3831 1389.8669 1417.1922 1426.3759 1428.6877 1432.9814 1438.7176 1442.5132 1445.0676 1446.0258 1452.8457 1480.3158 1565.5464 1669.9963 1722.5470 1756.8730 2983.0056 3012.3931 3027.5300 3050.0905 3062.8484 3073.9199 3100.3937 3111.8948 3126.0252 3131.5772 3146.9391 3150.8648 3155.8247 3161.8794 3181.9024
redmass: 5.9936 3.3305 5.3191 3.5373 1.0948 1.3091 2.1736 1.2300 1.0822 2.0025 2.4944 2.6476 2.7122 3.0881 4.0444 3.7990 6.4670 3.7028 5.5822 4.5447 4.7201 3.6916 4.3472 4.4638 4.2372 5.4416 4.5403 2.2235 5.2044 1.4887 1.9743 1.6145 2.1898 1.8288 1.8179 1.8731 2.1390 1.9439 1.4488 1.4193 1.6398 1.7633 2.2908 1.8790 1.6174 2.7763 2.2187 1.7599 3.7893 1.8552 1.4594 1.5805 1.3897 1.4060 2.0951 2.2666 1.0569 1.0843 1.0437 1.1680 1.1088 1.1619 1.0804 1.1108 2.9942 5.3060 11.3251 11.5186 8.0226 1.0463 1.0387 1.0389 1.0952 1.0380 1.1023 1.1017 1.0885 1.1019 1.0984 1.1032 1.0905 1.1027 1.0929 1.1032
irintensity: 704.5278 1.4264 2.0509 2.0723 2.5585 3.3788 10.2651 0.7551 2.0578 3.9317 5.2476 0.1378 1.5293 12.1634 5.7093 19.7676 1.5908 3.6013 2.9226 7.4436 9.6775 19.7017 25.0059 0.5888 49.4450 6.5169 12.1564 16.1107 6.8066 15.1161 9.3207 35.4784 8.0568 20.2135 36.9814 0.7548 48.5442 10.8155 3.5519 5.5028 5.2263 2.8462 1.5894 8.2763 25.8760 6.4754 7.8514 7.3690 35.9716 1.4270 52.8730 22.3176 23.6187 9.5439 22.1566 67.7169 7.9628 5.3842 12.7969 23.7451 7.2522 4.3752 8.8221 20.3048 70.4058 412.1671 630.9078 857.5023 21.2831 262.7020 144.5359 58.7123 53.6322 52.8898 48.3334 20.4209 46.5910 28.5718 12.2943 24.8833 46.9515 25.6796 31.8880 19.7043
temp: 298.150 k
press: 1.00000 atm
elementType: 6 6 6 6 1 1 6 6 1 6 6 6 8 8 6 1 1 1 6 1 1 1 6 1 1 1 6 1 1 1
symmnumber: 1
zpe: 644448.1 jmol-1
zpe.correction: 0.245457 hartree
zpe.thermalcorrener: 0.259856 hartree
zpe.thermalcorrenthalpy: 0.260800 hartree
zpe.thermalcorrgfe: 0.205618 hartree
zpe.sumelectzpe: -653.481811 hartree
zpe.sumelectthermal: -653.467413 hartree
zpe.sumelectthermalent: -653.466469 hartree
zpe.sumelectthermalfe: -653.521651 hartree
dipole: 5.2998 5.3240 0.0836
dipole: 7.5126
quadrupole: -110.2543 -111.2743 -93.1270
quadrupole: 5.7974 -1.4256 0.7622
quadrupole: -5.3691 -6.3891 11.7582 5.7974 -1.4256 0.7622
hfenergy: -653.7272688 hartree
pointgroup: C01 [X(C13H15O2)]
dipole: 2.1546647 -2.0152627 0.1794422 debye
polarizability: 220.8969844|5.0852672|202.8970715|-29.4250224|5.5131297|185.317039 unknown
InChI: InChI=1S/C13H15O2/c1-7-5-10-8(2)6-13(4,11(7)14)12(15)9(10)3/h5-6,10H,1-4H3
charge -1 multiplicity 1
30 atoms
C  1.30367405 -0.84839982 -0.4441639
C  1.02387091 0.4769146 -1.13260838
C  -0.55785945 0.77257636 0.79793343
C  0.45140965 0.01095242 1.63107164
H  2.17923996 -1.35309782 -0.87512255
H  0.37220352 0.0866253 2.72249566
C  0.11450197 1.3410865 -0.49152998
C  0.03505347 -1.31488305 -1.0645417
H  0.16020234 -1.81620948 -2.03327193
C  -1.63734424 -0.30415622 0.44486504
C  -1.25914883 -1.28088258 -0.53612474
C  1.34556709 -0.79951176 1.05088859
O  -0.20523396 2.48109413 -0.87770318
O  -2.76231379 -0.23470356 0.94879638
C  -2.37626366 -2.04109128 -1.19511473
H  -3.1954144 -1.379697 -1.53224898
H  -2.01452572 -2.60760473 -2.06832469
H  -2.84286901 -2.76943284 -0.50699786
C  1.72279731 0.86169223 -2.39328304
H  1.60926753 0.12601777 -3.21062726
H  1.30492568 1.81825055 -2.74488732
H  2.81402416 1.00281495 -2.25325708
C  2.31167739 -1.67523332 1.77806838
H  3.35450726 -1.4539302 1.48957455
H  2.22640797 -1.56182826 2.86938503
H  2.14064479 -2.73859761 1.53194881
C  -1.19484531 1.89676133 1.59189139
H  -0.42664299 2.59839331 1.95292588
H  -1.89242794 2.46165883 0.96052452
H  -1.74821593 1.49312149 2.45140358
