program: Gaussian 16
title: Title Card Required
version: ES64L-G16RevA.03
frameworkgroup: C1[X(C13H15O2)]
method: RPBE1PBE
basis: def2SVP
operation: Freq
keyword: #N
keyword: Geom=AllCheck
keyword: Guess=TCheck
keyword: SCRF=Check
keyword: GenChk
keyword: RPBE1PBE/def2SVPFreq
converged: YES YES NO YES
title: Mulliken charges:
elementType: C C C C H H C C H C C C O O C H H H C H H H C H H H C H H H
charge: 0.076848 -0.362924 -0.367010 -0.065192 -0.017102 0.005323 0.145769 -0.054499 0.016436 0.188975 -0.152712 -0.150717 -0.428564 -0.278124 0.015818 0.049085 0.030506 0.043931 0.011927 0.004406 0.008567 0.005030 0.023077 0.051081 0.036876 0.044148 0.078741 0.010568 0.021166 0.008565
chargesum: -1.00000
title: Mulliken charges with hydrogens summed into heavy atoms:
elementType: C C C C C C C C C O O C C C C
charge: 0.059746 -0.362924 -0.367010 -0.059869 0.145769 -0.038063 0.188975 -0.152712 -0.150717 -0.428564 -0.278124 0.139340 0.029930 0.155181 0.119041
1716.lowfreq: -37.6832 -19.9085 -0.0009 -0.0005 0.0002 19.5282 57.6454 77.0124 104.6665
frequency: 57.4153 76.5106 104.6016 131.6669 169.4916 181.6070 196.4575 208.1357 231.5972 245.3711 268.4285 272.1146 314.3142 327.1904 351.5163 360.0444 390.8135 409.6997 432.8424 455.1218 508.4743 519.0345 588.9936 600.8671 689.0186 703.3444 752.5658 776.9612 818.6584 855.2182 864.8637 874.8621 932.3681 946.3941 970.1708 1000.7992 1018.8374 1035.9713 1043.2068 1049.2336 1053.6979 1076.9608 1094.3972 1147.8822 1197.1245 1209.6448 1235.8771 1257.9975 1302.1928 1326.8551 1332.8751 1346.2914 1364.0753 1375.1195 1387.9952 1394.1534 1426.5234 1427.9455 1431.6868 1433.9446 1440.0065 1440.9034 1441.0365 1443.0808 1466.0790 1718.6784 1728.5466 1754.8607 1771.2409 2948.6469 2989.3705 3026.8650 3046.7610 3058.5212 3073.5353 3100.3486 3114.8857 3125.7779 3144.4778 3144.5607 3144.8831 3158.0369 3164.7892 3200.2353
redmass: 4.2900 4.0974 2.9433 5.2098 1.3081 1.0346 1.1488 1.1602 1.6058 2.3987 2.5625 2.6640 2.9430 3.6163 4.3039 3.9695 4.5334 5.4266 5.0672 3.9237 3.8534 3.7171 3.9224 4.1404 4.7546 5.7990 3.4737 2.6432 3.0164 1.9599 2.2437 2.1621 2.2079 2.2545 1.8977 1.7547 1.8427 2.1059 1.4351 1.5902 1.5696 1.8226 2.0153 1.9011 2.1417 1.8581 2.7119 2.1458 2.2889 1.7543 2.1476 1.3646 1.5299 1.5755 1.5571 1.9656 1.0769 1.1581 1.5027 1.0444 1.0581 1.0829 1.0531 1.0543 1.6708 8.1151 9.4615 10.8569 9.0336 1.0452 1.0976 1.0387 1.0379 1.0395 1.0862 1.1016 1.0948 1.1016 1.1006 1.1039 1.0948 1.1046 1.0931 1.1001
irintensity: 2.7468 0.2902 4.0081 7.3908 0.4672 0.1187 0.4680 0.4334 2.3173 3.7674 1.4089 6.0986 8.3694 6.4864 17.5918 4.5653 8.6835 11.7393 14.1904 3.3490 27.5872 5.9514 7.6104 2.9569 7.2054 5.0455 4.9059 32.2437 26.7215 14.4379 13.8334 7.6241 24.3568 79.1473 28.1218 41.3989 11.0713 38.6847 7.3216 9.9601 4.7552 17.0478 15.9911 16.1017 12.8483 15.6894 13.0249 2.7197 5.8314 4.3514 19.0716 66.8353 34.0539 13.4050 2.0762 12.1928 2.7345 22.0745 102.3431 7.3431 18.0631 10.6384 5.7605 8.8619 28.6221 52.1259 335.8576 561.3644 117.5813 260.6392 113.5047 58.2479 46.0353 58.1601 75.1188 19.9831 24.6037 17.2477 7.3079 40.4756 66.9599 25.3817 32.0936 9.9481
temp: 298.150 k
press: 1.00000 atm
elementType: 6 6 6 6 1 1 6 6 1 6 6 6 8 8 6 1 1 1 6 1 1 1 6 1 1 1 6 1 1 1
symmnumber: 1
zpe: 647204.6 jmol-1
zpe.correction: 0.246507 hartree
zpe.thermalcorrener: 0.261254 hartree
zpe.thermalcorrenthalpy: 0.262199 hartree
zpe.thermalcorrgfe: 0.206196 hartree
zpe.sumelectzpe: -653.488371 hartree
zpe.sumelectthermal: -653.473624 hartree
zpe.sumelectthermalent: -653.472680 hartree
zpe.sumelectthermalfe: -653.528682 hartree
dipole: 2.1290 -8.6566 2.1940
dipole: 9.1806
quadrupole: -106.9483 -111.0423 -95.9323
quadrupole: -1.8956 3.1679 6.1516
quadrupole: -2.3074 -6.4013 8.7087 -1.8956 3.1679 6.1516
hfenergy: -653.7348781 hartree
pointgroup: C01 [X(C13H15O2)]
dipole: 0.7329545 -3.45013 0.7781018 debye
polarizability: 216.9929946|-21.7554883|184.6499345|-15.72126|10.9772942|167.0220105 unknown
InChI: InChI=1S/C13H15O2/c1-7-5-10-8(2)6-13(4,11(7)14)12(15)9(10)3/h5-6,10H,1-4H3
charge -1 multiplicity 1
30 atoms
C  1.39559432 -0.82364991 -0.3404839
C  1.3814053 0.6348307 -0.75897046
C  -0.54748807 0.70839502 0.81939882
C  0.28718279 -0.18232225 1.70324815
H  2.3452097 -1.28740386 -0.65190845
H  0.07817794 -0.18347905 2.77956582
C  0.40121016 1.45704162 -0.2461709
C  0.2593522 -1.61924233 -0.94389826
H  0.50482208 -2.52018233 -1.52221547
C  -1.51205055 -0.10074771 -0.03800732
C  -1.04345907 -1.29434799 -0.81253475
C  1.25537477 -0.93576805 1.17510013
O  0.13617918 2.65806392 -0.49420376
O  -2.69109281 0.21535548 -0.11757383
C  -2.13493096 -2.09557013 -1.45533397
H  -2.72451233 -1.47398814 -2.1484495
H  -1.72361328 -2.95014283 -2.01229882
H  -2.84903571 -2.477552 -0.70681693
C  2.3067309 1.09983732 -1.83389462
H  2.16516615 0.57482908 -2.80381385
H  2.12218978 2.17145062 -2.01591528
H  3.38302534 0.98364015 -1.58749561
C  2.14937781 -1.86457672 1.92438046
H  3.20962138 -1.5858378 1.79027646
H  1.93022549 -1.86894392 3.00311593
H  2.0514408 -2.89920822 1.5499346
C  -1.31458959 1.73538703 1.62982584
H  -0.62037196 2.30945422 2.26231925
H  -1.81991489 2.43914535 0.95943674
H  -2.06445885 1.25289473 2.27623946
