program: Gaussian 16
title: Title Card Required
version: ES64L-G16RevC.01
method: RPBE1PBE
basis: def2SVP
operation: Freq
keyword: #N
keyword: Geom=AllCheck
keyword: Guess=TCheck
keyword: SCRF=Check
keyword: GenChk
keyword: RPBE1PBE/def2SVPFreq
converged: YES YES YES YES
title: Mulliken charges:
elementType: C C C C C C C O H C C O H C S C C C C C C C C C H H H H H H H H H H H H H H H H H
charge: -0.171687 0.099024 -0.343869 -0.157258 -0.014322 -0.324411 0.211340 -0.258791 -0.006795 -0.277121 0.133080 -0.413997 0.036630 0.069208 0.042505 -0.066739 -0.043186 -0.029410 -0.047703 -0.040551 -0.040254 0.059006 0.006167 0.076728 0.022603 0.017169 0.023117 0.026553 0.041554 0.039277 0.042294 0.033151 0.035557 0.043040 0.032198 0.008952 0.009993 0.009177 0.036291 0.047699 0.033784
chargesum: -1.00000
title: Mulliken charges with hydrogens summed into heavy atoms:
elementType: C C C C C C C O C C O C S C C C C C C C C C
charge: -0.171687 0.092229 -0.343869 -0.157258 0.022308 -0.324411 0.211340 -0.258791 -0.277121 0.133080 -0.413997 0.132097 0.042505 -0.066739 -0.016633 0.012144 -0.008426 0.001743 -0.007103 0.169801 0.034288 0.194501
1716.lowfreq: -28.9374 0.0009 0.0017 0.0022 3.3401 8.9343 32.1744 53.9043 69.0118
frequency: 27.0558 53.5503 68.6533 104.0596 113.6112 131.2530 137.3682 139.3076 147.8379 159.8954 173.3841 188.6955 198.3629 205.1249 223.1102 231.2993 238.4031 271.6843 291.7977 303.8418 321.7658 399.2479 418.7237 425.0566 430.6883 434.7416 476.0586 489.2040 496.9378 524.2517 547.6015 597.5791 626.6503 655.2530 682.6275 715.7846 722.2520 732.3345 758.2327 767.1637 797.3570 831.9344 856.1392 861.0059 879.9066 901.3107 908.5912 930.4619 937.0049 947.7259 960.6445 1003.7351 1004.9323 1011.9964 1023.0019 1025.8886 1039.0453 1043.1459 1056.7191 1070.9690 1087.4991 1104.6034 1107.6404 1123.9895 1127.4148 1148.9530 1156.1706 1168.7301 1183.4380 1185.7338 1195.4540 1230.1836 1265.9274 1318.3365 1321.2592 1322.3657 1348.5462 1361.9451 1376.2759 1390.8937 1391.7983 1411.6601 1431.2889 1435.2992 1440.2720 1440.9707 1442.0318 1444.2515 1446.2978 1448.4943 1468.2182 1475.6991 1500.6259 1512.7835 1654.7578 1669.7428 1717.7993 1837.4862 2956.2905 3014.4143 3041.6732 3049.2731 3055.2973 3091.3759 3116.9340 3131.7165 3142.9615 3144.3575 3148.6878 3150.3282 3167.1569 3198.1111 3204.9137 3207.0531 3214.4997 3226.7380 3254.6465
redmass: 5.0022 3.7768 4.8542 3.0677 3.8825 4.0183 3.0227 1.2800 1.8006 2.2040 2.5612 1.2989 1.2840 1.9689 2.4540 3.3742 2.4311 3.2367 4.5607 4.3207 3.9426 8.8132 2.9897 3.8360 6.7433 6.0227 4.9237 3.8204 3.9508 5.6784 4.2057 4.1534 6.3403 5.8928 3.7608 6.5442 1.7160 4.2513 3.2944 1.9794 4.0585 4.7898 3.2321 1.2550 2.3096 2.6858 2.5953 1.3948 1.6066 1.8213 2.0393 1.5031 2.1791 4.4004 2.1445 1.4745 1.4002 1.7913 2.3978 2.3229 1.9030 1.4742 2.1885 2.7402 2.5549 1.9602 1.0590 1.6842 1.9067 1.1505 2.6044 3.2571 3.4366 1.4145 2.7975 2.3949 1.3326 1.7105 1.3538 6.4183 2.0131 2.7683 1.1109 1.4080 1.0621 1.0563 1.1338 1.0731 1.0774 1.0618 1.9090 2.5421 5.4195 2.3163 6.4474 6.3855 10.5038 12.6996 1.0503 1.0915 1.0372 1.0370 1.0378 1.0884 1.0966 1.1038 1.1036 1.1036 1.1041 1.1026 1.1033 1.0880 1.0925 1.0897 1.0953 1.1000 1.0926
irintensity: 0.0856 0.5609 3.5312 0.3029 4.5437 1.4514 2.2728 1.4326 3.2564 2.0354 2.3377 0.7052 1.3495 0.0089 5.7669 1.2841 1.2908 2.7963 6.6421 24.1617 12.9794 12.7492 0.1104 1.7740 4.5681 1.3664 0.9207 4.5490 25.3396 2.4214 5.0697 0.4178 1.5771 3.5770 7.9411 14.8048 47.9351 2.0901 10.5730 38.1399 23.7080 4.9840 18.1609 0.5714 17.0420 7.9335 13.9517 2.7890 2.7352 63.3271 10.2376 6.7454 81.5297 4.0567 27.2132 9.4431 11.5162 14.5802 19.3652 20.0790 10.9169 10.3656 23.5642 32.8641 16.5875 2.8799 0.4693 18.8159 11.2856 0.9445 11.1759 7.2569 4.3988 2.8194 8.5926 3.2103 39.8000 9.6573 6.0366 3.2372 7.6037 10.8970 7.5851 60.5576 0.9033 9.8388 29.4100 16.7450 9.8779 9.4686 25.5923 9.6028 5.5599 73.8496 3.0120 70.5984 715.1315 498.8505 254.7477 96.4763 55.2600 40.1978 50.9791 67.5398 26.2125 22.5547 20.7312 24.0303 18.6304 29.0250 15.2519 1.8252 6.3145 0.0532 15.4391 12.7385 6.3272
temp: 298.150 k
press: 1.00000 atm
elementType: 6 6 6 6 6 6 6 8 1 6 6 8 1 6 16 6 6 6 6 6 6 6 6 6 1 1 1 1 1 1 1 1 1 1 1 1 1 1 1 1 1
symmnumber: 1
zpe: 866893.2 jmol-1
zpe.correction: 0.330182 hartree
zpe.thermalcorrener: 0.350701 hartree
zpe.thermalcorrenthalpy: 0.351646 hartree
zpe.thermalcorrgfe: 0.281949 hartree
zpe.sumelectzpe: -1281.980693 hartree
zpe.sumelectthermal: -1281.960174 hartree
zpe.sumelectthermalent: -1281.959230 hartree
zpe.sumelectthermalfe: -1282.028927 hartree
dipole: 11.4737 6.5195 -0.4916
dipole: 13.2057
quadrupole: -180.7847 -154.6114 -148.5520
quadrupole: -22.4594 -8.4172 -1.3974
quadrupole: -19.4686 6.7046 12.7640 -22.4594 -8.4172 -1.3974
hfenergy: -1282.3108753 hartree
pointgroup: C01 [X(C19H19O2S1)]
dipole: 4.5069568 2.5564607 -0.1932726 debye
polarizability: 369.9034044|-26.2819957|297.8606511|-6.3909905|1.9081485|212.4616791 unknown
InChI: InChI=1S/C19H19O2S/c1-10-12-17(3)14-16(2,13(10)20)15(21)18(12,4)19(14,17)22-11-8-6-5-7-9-11/h5-9,12,14H,1-4H3
charge -1 multiplicity 1
41 atoms
C  -1.27737702 1.42730992 -0.68710139
C  -2.14516151 1.01564121 0.51907151
C  -0.85127992 0.41643294 1.20605862
C  -0.02174879 0.96878213 0.01474896
C  -0.62816224 0.14677465 -1.1159773
C  -1.23972376 -1.15911159 -0.57369998
C  -0.89582029 -1.06808199 0.89854502
O  -0.65554486 -1.98366171 1.65681518
H  -2.48814618 1.8880554 1.09737332
C  -3.23752576 0.04874674 0.17726369
C  -2.82384436 -1.0844351 -0.52137701
O  -3.49211036 -2.00113758 -1.04978936
H  -0.11386677 0.13533395 -2.08035755
C  -0.76265356 -2.42050396 -1.24903313
S  1.51573796 1.8140525 0.0193406
C  2.75837097 0.55528485 -0.04827351
C  2.51036243 -0.79527718 0.22294208
C  3.55033696 -1.72213703 0.15760751
C  4.84541867 -1.31819629 -0.16426398
C  5.09501881 0.03083792 -0.42355602
C  4.06182062 0.96264594 -0.37105736
C  -0.5253153 0.80989347 2.61467633
C  -4.68261602 0.4157538 0.29925706
C  -1.51014286 2.59628659 -1.58458316
H  -1.02831177 -3.2939581 -0.63691319
H  0.33018799 -2.41776746 -1.39192536
H  -1.2555577 -2.5389984 -2.22460949
H  1.51096349 -1.13100799 0.49833362
H  3.33812243 -2.7734808 0.36964556
H  5.65640952 -2.04895365 -0.21224093
H  6.10494116 0.36333256 -0.67849473
H  4.26390487 2.01515797 -0.58970119
H  0.42973291 0.36846832 2.94177216
H  -1.31000856 0.45450999 3.30151747
H  -0.44660103 1.90350896 2.71645362
H  -4.98092287 1.29134132 -0.31687103
H  -5.29722356 -0.43528948 -0.03679736
H  -4.99199767 0.66062277 1.33485865
H  -1.59416285 3.53294392 -1.0089802
H  -2.44826072 2.46200763 -2.14838434
H  -0.69463152 2.71614986 -2.31482637
