program: Gaussian 16
title: Title Card Required
version: ES64L-G16RevC.01
frameworkgroup: C1[X(C19H19O2S)]
method: RPBE1PBE
basis: def2SVP
operation: Freq
keyword: #P
keyword: Geom=AllCheck
keyword: Guess=TCheck
keyword: SCRF=Check
keyword: GenChk
keyword: RPBE1PBE/def2SVP
keyword: Freq
converged: YES YES YES YES
title: Mulliken charges:
elementType: C C C C H H C C C C C O O C H H H C H H H C H H H C H H H S C C C C H C H C H H H
charge: -0.186227 -0.224146 -0.290092 -0.176553 -0.000556 -0.002986 0.203503 -0.216926 0.094595 -0.073092 -0.015918 -0.267709 -0.330569 0.030188 0.031292 0.037081 0.042834 0.063489 0.036557 0.027732 0.024692 -0.000486 0.037382 0.034216 0.051884 0.075328 0.026360 0.021722 0.019853 0.007809 -0.082425 -0.032935 -0.027282 -0.045557 0.029290 -0.038031 0.047390 -0.048722 0.040372 0.040119 0.036524
chargesum: -1.00000
title: Mulliken charges with hydrogens summed into heavy atoms:
elementType: C C C C C C C C C O O C C C C S C C C C C C
charge: -0.186784 -0.224146 -0.290092 -0.179539 0.203503 -0.216926 0.094595 -0.073092 -0.015918 -0.267709 -0.330569 0.141396 0.152470 0.122996 0.143263 0.007809 -0.082425 -0.003645 0.020108 -0.005185 0.002088 -0.012197
polarizability: 4.18267374e+02 1.21384564e+01 3.20656234e+02 -7.57944440e+00 1.51542126e+01 2.45932618e+02
1716.lowfreq: -7.8171 0.0021 0.0022 0.0024 6.3367 10.3567 17.0277 37.7533 40.9348
frequency: 15.6129 37.7255 40.9019 75.6803 92.0029 95.9553 101.8016 107.8583 126.2673 178.0922 195.7303 217.2223 218.4505 227.0441 240.2748 245.8477 269.5207 291.7076 300.6573 328.7562 354.3116 359.2789 366.3061 385.7389 417.8098 420.0650 431.9953 461.2648 475.7812 491.9473 515.0767 554.9980 590.2352 601.2995 615.0796 626.9809 634.8915 670.3621 680.0888 710.2056 722.0932 724.5838 764.5140 794.1360 824.2729 849.4419 862.8757 912.3096 929.2059 938.7368 980.0874 996.5167 1004.6053 1005.1850 1010.2524 1024.1558 1025.3899 1028.5344 1034.7053 1038.3253 1044.3098 1055.1039 1097.1026 1114.6676 1123.8558 1149.9920 1154.8100 1178.7227 1184.4220 1213.4820 1248.8186 1260.0703 1286.4735 1308.4525 1313.5572 1365.7815 1373.8970 1375.5087 1386.9710 1390.5887 1400.1390 1425.5380 1434.5935 1435.7783 1437.5813 1440.3998 1446.5417 1447.5186 1449.6621 1475.9900 1508.2369 1542.1028 1559.1426 1598.0045 1653.0261 1668.5441 1700.1064 1820.8115 3040.5496 3047.2502 3063.5992 3065.7384 3121.8118 3124.0623 3148.3471 3157.6884 3162.6709 3171.3195 3173.7892 3175.0846 3188.5375 3192.6121 3194.5772 3202.6646 3210.3839 3217.4452 3225.7370
redmass: 3.8943 4.5733 4.0574 1.1546 3.5826 2.2618 4.1355 1.4843 5.3547 4.3743 1.1382 2.0218 2.5882 2.4404 3.6660 2.0240 2.6489 2.8870 2.8040 3.2095 4.0997 5.0348 4.9479 6.8025 7.2451 3.1729 7.5237 5.5404 4.2977 3.2225 5.3260 4.5432 3.4477 2.7668 3.1784 5.6493 2.2122 3.3499 1.4622 6.6353 1.8975 4.0908 1.7754 3.4837 2.7821 3.8821 1.2539 2.0702 1.3911 2.0900 2.4208 3.6014 1.4189 1.6775 5.6041 1.3222 1.6254 1.9282 1.5310 1.5343 2.6101 2.3235 1.4660 2.9157 2.2138 1.6220 1.0628 1.1541 2.6769 1.9056 3.6163 3.7537 2.7444 3.2065 1.3815 1.4061 1.3215 1.3926 1.6651 6.6632 3.0619 1.0818 1.0872 1.0620 1.0600 1.0975 1.0731 1.0646 1.0592 2.5593 2.3062 5.1213 6.4140 8.2422 6.5390 6.3757 12.2319 12.7063 1.0394 1.0394 1.0367 1.0367 1.1007 1.1011 1.1041 1.1040 1.1031 1.1044 1.1032 1.1041 1.0895 1.0914 1.0879 1.0885 1.0936 1.0953 1.1007
irintensity: 0.1395 0.5561 0.3901 0.6767 4.2162 0.9160 0.9224 0.4025 4.0537 0.2322 1.8194 13.3131 7.7558 9.0639 2.4515 4.9418 1.7999 4.8602 4.6265 4.6604 1.6823 27.4739 16.3711 47.7514 10.1773 3.2596 4.2248 2.3794 15.4365 14.2345 5.1975 12.7298 34.9253 1.4371 1.0329 1.2397 29.3331 2.7648 118.7879 11.7907 39.1156 18.9071 53.8592 32.5891 19.0388 10.7804 0.0056 14.0540 3.5590 28.1089 13.0299 18.6435 2.5387 14.5337 2.9940 0.9442 10.4564 10.8143 12.8293 1.3350 31.9278 31.0446 11.1518 26.7393 9.0538 5.5428 0.7364 6.5615 1.1742 17.2799 18.7377 4.5743 5.4607 57.3381 1.4836 30.6947 27.2410 14.6385 4.8952 6.0917 45.1975 13.3341 31.2937 6.1028 4.7172 21.4213 6.7271 14.8471 8.6607 10.3056 90.3900 59.7338 122.7891 87.5035 2.8685 105.4118 1024.4592 418.8216 61.8477 55.8334 56.1787 31.2187 18.9661 24.6861 28.7511 22.1602 19.6689 12.1880 8.3896 14.0532 15.3115 9.0890 1.7934 0.3961 15.0828 4.3707 22.5808
temp: 298.150 k
press: 1.00000 atm
elementType: 6 6 6 6 1 1 6 6 6 6 6 8 8 6 1 1 1 6 1 1 1 6 1 1 1 6 1 1 1 16 6 6 6 6 1 6 1 6 1 1 1
symmnumber: 1
zpe: 862477.2 jmol-1
zpe.correction: 0.328500 hartree
zpe.thermalcorrener: 0.349772 hartree
zpe.thermalcorrenthalpy: 0.350716 hartree
zpe.thermalcorrgfe: 0.278084 hartree
zpe.sumelectzpe: -1281.992092 hartree
zpe.sumelectthermal: -1281.970821 hartree
zpe.sumelectthermalent: -1281.969877 hartree
zpe.sumelectthermalfe: -1282.042508 hartree
dipole: -7.3947 2.7959 -0.0820
dipole: 7.9060
quadrupole: -157.6340 -151.0971 -160.6871
quadrupole: 9.6310 -1.8415 -4.1229
quadrupole: -1.1612 5.3756 -4.2144 9.6310 -1.8415 -4.1229
hfenergy: -1282.3205925 hartree
pointgroup: C01 [X(C19H19O2S1)]
dipole: -2.909287 1.0999987 -0.0322495 debye
polarizability: 418.2673734|12.1384592|320.6562347|-7.5794448|15.1542124|245.9326185 unknown
InChI: InChI=1S/C19H19O2S/c1-12-10-18(3)15(20)13(2)16(19(4,11-12)17(18)21)22-14-8-6-5-7-9-14/h5-11H,1-4H3
charge -1 multiplicity 1
41 atoms
C  1.535179 1.722366 0.787285
C  0.68991 0.507702 1.103092
C  2.597526 -0.933514 0.267185
C  3.190474 0.330527 -0.297905
H  1.126584 2.70513 1.041379
H  4.00441 0.206996 -1.018391
C  1.632444 -0.648035 1.378252
C  0.040611 0.328343 -0.254142
C  1.773601 -1.290047 -0.987979
C  0.586994 -0.468769 -1.238697
C  2.692495 1.588249 0.023098
O  1.601346 -1.289482 2.411435
O  2.168621 -2.143762 -1.784789
C  -0.005267 -0.634941 -2.604312
H  -0.80783 0.091138 -2.788998
H  0.768743 -0.527939 -3.380716
H  -0.419809 -1.650029 -2.72628
C  -0.260063 0.715365 2.264782
H  -0.924124 1.569578 2.071595
H  -0.877106 -0.17668 2.44507
H  0.316791 0.919617 3.178879
C  3.331997 2.816575 -0.571971
H  3.228816 3.685823 0.09643
H  4.404885 2.667243 -0.768657
H  2.853984 3.085993 -1.529913
C  3.6017 -2.005703 0.626023
H  4.210181 -2.257345 -0.253166
H  4.262445 -1.657182 1.433904
H  3.097166 -2.921504 0.968336
S  -1.320447 1.412834 -0.617007
C  -2.745311 0.430116 -0.223083
C  -3.995028 1.067515 -0.256177
C  -2.679295 -0.930881 0.096552
C  -5.155004 0.351575 0.028142
H  -4.05601 2.13166 -0.502823
C  -3.846223 -1.637755 0.38421
H  -1.70868 -1.431838 0.118793
C  -5.088956 -1.0051 0.352247
H  -6.121361 0.862649 0.000318
H  -3.778207 -2.700033 0.634966
H  -6.000173 -1.564202 0.578613
