program: Gaussian 16
title: Title Card Required
version: ES64L-G16RevC.01
method: RPBE1PBE
basis: def2SVP
operation: Freq
keyword: #P
keyword: Geom=AllCheck
keyword: Guess=TCheck
keyword: SCRF=Check
keyword: GenChk
keyword: RPBE1PBE/def2SVP
keyword: Freq
converged: YES YES NO YES
title: Mulliken charges:
elementType: C C C C C C C C C H H O O C C C S C C C C C C C H H H H H H H H H H H H H H H H H H
charge: -0.091209 -0.131288 -0.112210 0.098481 -0.408256 0.138128 -0.177566 -0.120436 0.154921 0.067843 0.093485 -0.218256 -0.227516 0.064588 0.039619 0.032852 0.100374 -0.150115 0.005305 -0.037831 -0.027902 -0.039655 -0.005970 -0.001718 0.036133 0.055852 0.057197 0.050129 0.076851 0.054804 0.058849 0.047254 0.058118 0.056535 0.055856 0.051440 0.050716 0.052169 0.048335 0.050660 0.050294 0.043140
chargesum: -0.00000
title: Mulliken charges with hydrogens summed into heavy atoms:
elementType: C C C C C C C C C O O C C C S C C C C C C C
charge: 0.002276 -0.095155 -0.112210 0.166324 -0.408256 0.138128 -0.177566 -0.120436 0.154921 -0.218256 -0.227516 0.227766 0.230122 0.194758 0.100374 -0.150115 0.061161 0.013609 0.022814 0.012515 0.042364 0.142377
polarizability: 3.75221317e+02 -4.31064764e+01 2.51339293e+02 -1.80073805e+00 -1.11989406e+01 2.59845254e+02
1716.lowfreq: -10.1816 -2.8493 -0.0029 -0.0028 -0.0021 6.2117 19.6402 31.1738 51.0789
frequency: 18.6739 31.0721 51.0684 65.7094 68.7960 89.1947 108.9943 126.7974 142.7263 159.7679 180.4483 215.8504 220.7985 225.4760 241.3266 245.8948 256.8099 265.1287 285.3291 307.5880 313.9114 334.9906 361.3652 393.7161 415.4654 422.5112 449.6666 464.8007 478.8762 491.8717 513.3922 547.6826 598.5884 621.4580 624.6793 664.7371 716.4362 722.7672 744.2478 761.6835 772.9849 774.1171 811.7816 860.7835 863.8474 870.9304 908.4531 942.0319 944.4383 986.3320 1007.5560 1010.8155 1012.6645 1024.2579 1032.1278 1032.9098 1033.7036 1043.9395 1051.4290 1053.3784 1055.9326 1101.3925 1115.2715 1120.2901 1125.1168 1145.6989 1159.5824 1164.1302 1181.8720 1184.6802 1209.5596 1232.6430 1267.6602 1276.6482 1301.4025 1317.9682 1335.1483 1357.5497 1367.3573 1375.4555 1390.2377 1390.5914 1393.5701 1396.6932 1428.0619 1432.5516 1441.9824 1443.3990 1445.8704 1448.7805 1449.9912 1452.4829 1477.2049 1512.0003 1658.7774 1668.7633 1687.1025 1758.5324 1822.3266 1864.9212 3008.8621 3051.8164 3054.4821 3065.0220 3065.8178 3084.3667 3137.4782 3140.1854 3162.0377 3162.8770 3164.1769 3171.0834 3171.4066 3177.6949 3183.7662 3206.4242 3210.9256 3217.7533 3224.4261 3232.7909
redmass: 4.8705 4.5661 4.4883 4.6645 4.0631 3.2167 1.2078 6.2632 3.8497 2.0185 3.9059 2.1108 1.0771 2.9224 1.3272 1.6585 2.5752 2.7752 3.0334 4.0743 3.9391 4.0797 4.7370 7.2965 4.1548 3.8026 4.3635 4.4540 5.9518 3.5364 4.0548 4.3190 4.7615 4.4952 6.3637 3.5961 5.0558 1.8496 4.5168 4.5599 1.8996 2.7011 2.4468 1.7909 1.2521 2.4752 2.1356 1.9788 1.3797 2.1430 1.4810 1.8402 4.3126 2.3736 1.6729 1.8338 1.3435 1.9832 1.7761 1.9200 2.3765 1.4371 1.6063 3.0209 2.9425 1.6511 1.0652 2.3476 1.1097 2.1235 2.2463 3.6216 2.0751 1.5917 1.7913 1.3408 2.3140 1.7719 1.8330 1.2678 1.6652 4.4235 1.9231 1.6332 1.0693 1.0552 1.1152 1.0786 1.0544 1.0609 1.0529 1.0668 2.4722 2.3371 6.6361 6.4590 9.8113 8.2127 12.8368 12.5723 1.0833 1.0383 1.0384 1.0368 1.0374 1.0849 1.1013 1.1012 1.1047 1.1051 1.1046 1.1053 1.1045 1.0926 1.1044 1.0880 1.0900 1.0935 1.0974 1.1013
irintensity: 0.1244 1.0779 0.2740 1.5881 0.7015 5.8322 1.0919 3.8596 0.8197 2.1128 1.3530 2.3362 0.6426 1.7244 0.4488 0.1423 0.6526 1.7593 4.1398 5.5530 2.4394 15.9667 8.7124 7.8103 1.0454 1.2731 9.0961 6.1709 1.6628 18.2308 8.0733 4.7056 13.3501 1.4358 0.3425 7.7416 9.2645 67.7601 0.3043 4.4456 36.6422 7.2767 18.7254 3.5815 0.1408 24.6716 3.5454 8.3270 2.4998 19.7922 1.9981 37.2787 17.6911 38.1388 36.4731 18.4159 0.9182 18.3931 52.5595 37.0403 11.6734 17.1786 3.6748 6.8217 4.1202 17.0311 0.0915 21.8590 2.5272 28.2863 0.7999 37.1700 14.0452 6.7167 27.5910 1.3743 207.0082 7.4544 29.5015 14.5547 5.7896 20.5498 81.5177 4.3064 21.3397 14.5376 65.6587 39.4995 10.4471 14.3148 10.6864 13.6938 13.9297 44.0853 19.4788 33.4843 118.7461 5.7500 368.4404 598.1088 10.8181 25.5912 17.1454 25.7101 24.0774 10.7116 7.3236 4.7352 15.1990 13.8217 15.3823 2.0307 12.4068 15.3921 4.8694 0.6885 0.8353 0.5181 5.5897 8.0715
temp: 298.150 k
press: 1.00000 atm
elementType: 6 6 6 6 6 6 6 6 6 1 1 8 8 6 6 6 16 6 6 6 6 6 6 6 1 1 1 1 1 1 1 1 1 1 1 1 1 1 1 1 1 1
symmnumber: 1
zpe: 902231.8 jmol-1
zpe.correction: 0.343642 hartree
zpe.thermalcorrener: 0.364863 hartree
zpe.thermalcorrenthalpy: 0.365807 hartree
zpe.thermalcorrgfe: 0.293019 hartree
zpe.sumelectzpe: -1282.507661 hartree
zpe.sumelectthermal: -1282.486441 hartree
zpe.sumelectthermalent: -1282.485496 hartree
zpe.sumelectthermalfe: -1282.558284 hartree
dipole: -6.4446 1.5589 -1.9932
dipole: 6.9235
quadrupole: -143.7075 -137.7174 -133.7594
quadrupole: -2.9570 -16.3417 -3.4318
quadrupole: -5.3128 0.6774 4.6354 -2.9570 -16.3417 -3.4318
hfenergy: -1282.8513033 hartree
pointgroup: C01 [X(C19H20O2S1)]
dipole: -2.5354817 0.6133289 -0.7841807 debye
polarizability: 375.2213168|-43.1064764|251.3392928|-1.800738|-11.1989406|259.8452538 unknown
InChI: InChI=1S/C19H20O2S/c1-11-10-12(2)17(20)19(4)15(11)16(13(3)18(19)21)22-14-8-6-5-7-9-14/h5-10,12,15H,1-4H3
charge 0 multiplicity 1
42 atoms
C  2.97080582 1.37376687 -0.67223916
C  1.68127822 2.05204124 -1.05171493
C  0.47775603 1.66535429 -0.60508373
C  0.34358511 0.45289885 0.29985224
C  1.63019034 0.0565384 1.06895756
C  2.81993981 0.96539044 0.77943158
C  -0.00433592 -0.80475871 -0.47978131
C  0.95340319 -1.76433492 -0.42564906
C  2.00301311 -1.32975026 0.50388627
H  -0.45667041 0.66718804 1.02679825
H  3.06726015 0.43325981 -1.25213258
O  3.58183754 1.3196644 1.64486074
O  2.97608684 -1.96762018 0.84013851
C  1.40104558 -0.07063639 2.5692853
C  0.99011383 -3.09240855 -1.08565141
C  -0.77285858 2.40007945 -0.96902012
S  -1.439968 -0.99500838 -1.46359924
C  -2.7239993 -0.38220614 -0.39704918
C  -2.75617277 -0.7101291 0.96282126
C  -3.79751489 -0.2407527 1.76023054
C  -4.8224745 0.52486435 1.20265853
C  -4.80187508 0.82383362 -0.15942513
C  -3.75166337 0.3798398 -0.96114556
C  4.19378464 2.23795992 -0.91211531
H  1.75574344 2.93614631 -1.69498973
H  2.30716765 -0.45450382 3.05651599
H  1.16046859 0.90900467 3.00768884
H  0.569354 -0.76156824 2.77488346
H  1.54191726 -3.04421571 -2.03936115
H  -0.02397198 -3.45851136 -1.30586588
H  1.51457736 -3.81703741 -0.44562451
H  -0.54192316 3.33419658 -1.50075289
H  -1.36654615 2.64219381 -0.07223987
H  -1.41927819 1.79031976 -1.61953879
H  -1.97001713 -1.33441533 1.39482989
H  -3.81346519 -0.48827182 2.82462766
H  -5.64095735 0.8848305 1.83067541
H  -5.60357518 1.41886335 -0.60385066
H  -3.72576456 0.63205293 -2.02425094
H  4.27450685 2.49959772 -1.97776256
H  5.11324468 1.71485021 -0.6138477
H  4.13460352 3.17096491 -0.33169901
