program: Gaussian 16
title: Title Card Required
version: ES64L-G16RevC.01
method: RPBE1PBE
basis: def2SVP
operation: Freq
keyword: #P
keyword: Geom=AllCheck
keyword: Guess=TCheck
keyword: SCRF=Check
keyword: GenChk
keyword: RPBE1PBE/def2SVP
keyword: Freq
converged: YES YES NO NO
title: Mulliken charges:
elementType: C C C C C C C C C H H O O C C C S C C C C C C C H H H H H H H H H H H H H H H H H H
charge: -0.082368 -0.141260 -0.105364 0.082535 -0.413073 0.138021 -0.170569 -0.138057 0.170461 0.069327 0.087142 -0.218106 -0.229115 0.057710 0.066745 0.028029 0.109988 -0.152103 0.008601 -0.034584 -0.027017 -0.041097 -0.001732 -0.000256 0.036893 0.058131 0.053072 0.049773 0.071384 0.054826 0.055678 0.048298 0.062989 0.053448 0.053395 0.049421 0.050644 0.051998 0.042590 0.048777 0.049984 0.044838
chargesum: -0.00000
title: Mulliken charges with hydrogens summed into heavy atoms:
elementType: C C C C C C C C C O O C C C S C C C C C C C
charge: 0.004774 -0.104367 -0.105364 0.151862 -0.413073 0.138021 -0.170569 -0.138057 0.170461 -0.218106 -0.229115 0.218687 0.248633 0.192763 0.109988 -0.152103 0.061995 0.014837 0.023628 0.010901 0.040859 0.143343
chargesum: 0.00000
polarizability: 3.40877568e+02 -3.31646768e-01 2.52808848e+02 1.69822818e+00 -1.35327268e+01 2.77770467e+02
1716.lowfreq: -27.1786 -12.8412 0.0009 0.0015 0.0021 5.5147 21.5972 24.8780 36.3580
frequency: 12.1353 20.7831 36.0056 57.5028 67.8301 97.6747 126.2064 133.8696 159.6922 162.9014 191.5751 196.5227 216.4682 220.4115 233.6103 237.9763 252.0878 262.8562 277.0867 293.4995 319.0180 332.4566 369.5676 396.6385 415.2401 429.4547 444.0504 462.2285 477.5461 503.4788 516.0593 545.4394 574.9751 624.8817 634.0224 655.5137 715.6340 720.3924 737.2187 755.2991 771.7463 777.9544 821.3458 860.5533 865.1567 868.3616 906.3531 942.4671 944.4216 987.2903 1006.7040 1012.7769 1013.3379 1025.3552 1028.9950 1033.2358 1035.1277 1042.7716 1052.2597 1054.5483 1057.0440 1098.2705 1117.1856 1123.2369 1125.7970 1149.8278 1158.7467 1162.6629 1178.6178 1179.6476 1210.1945 1222.8216 1266.2624 1274.4829 1302.6722 1314.7892 1331.8483 1359.2920 1367.1501 1375.2146 1385.6877 1390.8907 1393.6426 1399.3282 1430.2032 1433.6203 1438.2622 1441.7563 1447.0325 1450.0397 1450.7783 1452.8009 1477.2331 1510.9194 1660.4404 1667.7045 1681.0430 1758.6555 1820.4151 1864.5426 3019.6504 3042.5708 3054.8007 3063.5057 3065.8526 3066.7245 3123.0148 3141.5073 3161.8664 3162.3137 3165.4404 3171.3043 3172.8819 3183.3574 3189.0051 3208.6971 3214.4887 3221.5428 3226.5295 3233.2469
redmass: 4.0059 4.8615 5.2147 5.7600 4.8768 4.0177 4.0881 6.4790 1.0791 1.5714 3.0969 1.6205 2.7951 1.2654 1.5964 1.6071 2.9438 2.8350 3.4707 3.2910 4.1602 4.1396 4.4697 5.8616 3.0786 6.9257 4.0438 4.6765 4.8118 4.8072 3.8520 4.3948 4.5776 6.3155 4.2058 3.7066 2.9858 2.4680 4.7331 4.2367 2.0931 2.4090 2.3448 1.3773 1.7648 2.2874 2.1836 1.8997 1.4128 2.2224 1.5156 1.7167 4.1326 2.1919 1.6326 1.3513 1.8540 1.9550 1.9846 2.3763 2.1487 1.4415 2.5613 2.3699 2.1042 1.5451 1.0703 2.1388 1.1577 2.0785 2.1579 3.3038 1.7049 1.7752 1.9348 1.3533 2.4772 1.7179 1.7266 1.2885 1.5496 6.7348 1.7071 1.7726 1.0530 1.0621 1.1665 1.0635 1.0557 1.0498 1.0587 1.0649 2.4700 2.3585 6.6318 6.5188 10.3384 8.0742 12.8126 12.5134 1.0824 1.0392 1.0389 1.0816 1.0375 1.0404 1.1013 1.1001 1.1047 1.1056 1.1043 1.1046 1.1054 1.0932 1.1037 1.0868 1.0898 1.0937 1.0974 1.1014
irintensity: 0.2018 0.3009 0.6605 1.8441 1.7549 1.3985 1.6697 3.3969 2.6917 2.5700 1.1966 0.2137 3.2765 0.2086 1.1144 0.5995 1.0895 2.5948 2.4117 5.4892 11.3164 6.1167 7.6825 4.4715 0.0784 2.1163 7.8394 12.8572 5.7757 18.5772 5.8147 7.4170 6.1607 0.3766 2.7265 5.6829 20.8830 48.3846 8.7997 5.2744 14.8986 17.4406 23.6634 0.6746 3.4095 29.4370 3.3149 6.6866 1.7358 10.5399 2.6605 44.7252 16.5905 59.4505 16.3950 1.8026 31.1267 12.4333 72.7115 18.8506 11.6802 17.8660 10.0535 5.1726 7.2219 5.8935 0.2043 31.9830 5.3724 28.5582 3.9803 22.4183 9.7889 5.3480 58.8484 2.3881 197.5369 0.8265 22.9594 10.5209 35.4545 1.5295 36.8881 7.4109 14.7300 23.9917 104.4328 9.9915 16.8432 6.7053 13.3729 13.1614 18.9623 40.5666 1.7069 26.0497 107.6534 7.7322 275.6399 644.2781 9.1273 23.8796 13.1709 4.4680 36.7992 23.3836 9.1017 5.2572 15.6469 14.8645 14.1965 13.3525 2.3675 11.8854 3.0876 0.2905 2.5325 1.9042 3.0978 8.1511
temp: 298.150 k
press: 1.00000 atm
elementType: 6 6 6 6 6 6 6 6 6 1 1 8 8 6 6 6 16 6 6 6 6 6 6 6 1 1 1 1 1 1 1 1 1 1 1 1 1 1 1 1 1 1
symmnumber: 1
zpe: 901718.9 jmol-1
zpe.correction: 0.343447 hartree
zpe.thermalcorrener: 0.364739 hartree
zpe.thermalcorrenthalpy: 0.365683 hartree
zpe.thermalcorrgfe: 0.291880 hartree
zpe.sumelectzpe: -1282.507638 hartree
zpe.sumelectthermal: -1282.486346 hartree
zpe.sumelectthermalent: -1282.485402 hartree
zpe.sumelectthermalfe: -1282.559205 hartree
dipole: 5.3665 3.6800 -0.0520
dipole: 6.5072
quadrupole: -141.0550 -145.5747 -127.4652
quadrupole: -17.1277 7.6063 -1.0055
quadrupole: -3.0234 -7.5431 10.5665 -17.1277 7.6063 -1.0055
hfenergy: -1282.8510847 hartree
pointgroup: C01 [X(C19H20O2S1)]
dipole: 2.1113277 1.4478244 -0.0204638 debye
polarizability: 340.8775684|-0.3316468|252.8088482|1.6982282|-13.5327268|277.7704672 unknown
InChI: InChI=1S/C19H20O2S/c1-11-10-12(2)17(20)19(4)15(11)16(13(3)18(19)21)22-14-8-6-5-7-9-14/h5-10,12,15H,1-4H3
charge 0 multiplicity 1
42 atoms
C  -1.8876643 0.42652204 1.73646441
C  -1.60428349 1.78051011 1.13897755
C  -1.40619499 1.94927662 -0.17622132
C  -1.37653708 0.72968556 -1.07356396
C  -2.34465751 -0.40785265 -0.66537528
C  -2.84215887 -0.2617938 0.77678321
C  -0.01579873 0.05916798 -1.09137975
C  -0.05936166 -1.27811337 -0.86674759
C  -1.45918177 -1.67094426 -0.6578061
H  -1.62535166 1.04474227 -2.10193841
H  -0.95695104 -0.17636485 1.72803397
O  -3.92327377 -0.67504061 1.114893
O  -1.8777456 -2.79989532 -0.52794525
C  -3.51827135 -0.59776092 -1.6131393
C  1.03502622 -2.27941305 -0.87616544
C  -1.20422907 3.28323457 -0.81524114
S  1.41489135 1.01184781 -1.43117457
C  2.58989075 0.39590559 -0.24627624
C  2.24300203 0.27965881 1.10407295
C  3.19290125 -0.15969513 2.02236972
C  4.49253724 -0.45468093 1.60547202
C  4.83873843 -0.31468178 0.26225066
C  3.88868561 0.10338382 -0.66935656
C  -2.43217852 0.49339078 3.14978824
H  -1.62492608 2.64670494 1.8095536
H  -4.11611805 -1.46097223 -1.29338499
H  -4.1649447 0.2924956 -1.61487155
H  -3.16078595 -0.77455544 -2.63857502
H  1.53301239 -2.34233163 0.1058305
H  1.80591315 -2.02985691 -1.61934889
H  0.61715206 -3.27182288 -1.10002334
H  -1.21080991 4.09422161 -0.07309157
H  -1.99858069 3.47988105 -1.55582794
H  -0.24714405 3.32083373 -1.3612567
H  1.2304959 0.53154826 1.42941496
H  2.91761234 -0.26041918 3.07525233
H  5.23636147 -0.79335844 2.33069485
H  5.85421015 -0.54415884 -0.0702376
H  4.15217231 0.19068057 -1.72621874
H  -1.70519236 0.98074948 3.81653409
H  -2.64257483 -0.51127118 3.5426599
H  -3.36916152 1.06942505 3.1823976
