program: Gaussian 16
title: Title Card Required
version: ES64L-G16RevC.01
frameworkgroup: C1[X(C13H16O2)]
method: RPBE1PBE
basis: def2SVP
operation: Freq
keyword: #P
keyword: Geom=AllCheck
keyword: Guess=TCheck
keyword: SCRF=Check
keyword: GenChk
keyword: RPBE1PBE/def2SVP
keyword: Freq
converged: YES YES YES YES
title: Mulliken charges:
elementType: C O H H C C C C C C C C O C C C C H H H H H H H H H H H H H H
charge: 0.339059 -0.240700 0.054157 0.054158 -0.369288 0.359836 -0.116294 -0.353379 -0.116296 0.359836 -0.369290 -0.353379 -0.240700 0.065209 0.071837 0.065209 0.071838 0.051619 0.051619 0.047829 0.055078 0.055537 0.052379 0.044081 0.052571 0.047829 0.055078 0.055536 0.044080 0.052571 0.052379
chargesum: -0.00000
title: Mulliken charges with hydrogens summed into heavy atoms:
elementType: C O C C C C C C C C O C C C C
charge: 0.442298 -0.240700 -0.369288 0.359836 -0.062136 -0.353379 -0.062138 0.359836 -0.369290 -0.353379 -0.240700 0.223652 0.220869 0.223652 0.220868
chargesum: 0.00000
polarizability: 1.82601629e+02 -5.04223643e+00 1.68973472e+02 -5.07706660e-05 1.16228512e-05 1.64933896e+02
1716.lowfreq: -0.0006 -0.0003 0.0007 5.5263 11.4949 13.9130 96.3760 121.5053 138.6911
frequency: 96.3760 121.5044 138.6909 151.1667 151.4779 184.0988 186.3635 227.3258 247.7294 259.4600 290.0473 329.9766 333.3840 355.0688 392.0095 413.7203 414.2190 471.8071 484.2324 496.2308 551.1420 564.4111 606.8865 649.3584 702.5244 728.2206 736.8810 824.8222 824.8863 880.5902 917.6155 934.6574 947.7329 966.5081 991.0459 995.6057 1006.4891 1009.5632 1057.7388 1088.5626 1088.6160 1113.6398 1129.9804 1132.3119 1192.6556 1197.7396 1220.1534 1226.2819 1251.0175 1287.1931 1307.7999 1361.8465 1371.9603 1381.2129 1397.6478 1398.8512 1411.3827 1424.6247 1434.8925 1436.9859 1439.8097 1439.9380 1442.7038 1446.8371 1452.2329 1454.7894 1458.9903 1479.7116 1509.2010 1814.0720 1819.2897 3051.4302 3059.4273 3060.0715 3071.9835 3072.2160 3104.0217 3145.4638 3145.4839 3161.0167 3161.0400 3177.9706 3177.9812 3189.0988 3189.1225 3201.0659 3201.8097
redmass: 11.5132 4.0025 1.9893 1.2584 1.3503 1.1878 1.1912 1.7817 2.1315 2.2071 2.7128 2.6621 2.3917 2.9094 5.5175 5.2674 2.8403 3.5998 5.3994 3.5215 6.1268 3.6006 3.9923 6.6513 3.5998 3.3693 3.5030 3.2770 3.0479 3.2914 2.0420 1.6357 1.9275 1.5862 1.3773 1.4729 1.3703 1.4984 1.5511 1.5759 1.7735 2.0497 2.2856 3.6018 2.1553 2.4357 2.5053 2.2790 1.2282 1.8427 2.5571 3.2802 1.9652 1.4657 1.2774 1.3247 2.0319 2.0188 1.3790 1.1467 1.1390 1.0966 1.1051 1.1363 1.3658 1.2113 1.1446 1.8336 3.1936 11.9942 12.3634 1.0605 1.0391 1.0403 1.0385 1.0386 1.1053 1.1040 1.1040 1.1039 1.1038 1.1040 1.1038 1.1022 1.1023 1.0923 1.0924
irintensity: 8.1929 0.7438 0.0137 0.0715 0.0697 0.1241 0.1211 0.0639 0.0288 1.3469 0.0504 15.1271 0.0330 5.8835 2.0259 1.3998 10.1932 0.0105 3.7584 21.8970 1.8313 0.0091 21.3735 2.0241 2.4853 7.2739 1.9195 5.1765 1.7319 2.8995 70.0529 10.3218 13.3678 4.2022 7.4278 3.4526 0.6136 1.7141 0.0077 15.1499 48.5665 62.9122 13.3940 4.8947 1.6500 78.0339 7.4303 0.4879 0.0446 35.3875 0.4791 143.9756 2.6758 0.8309 10.2496 2.2574 14.0693 25.2640 9.8508 18.2527 0.3781 0.1761 9.9027 17.6841 45.2886 21.0790 3.6469 81.2516 7.0449 705.9731 254.8138 28.9015 15.1986 59.6186 49.4460 0.5914 19.5812 0.2337 34.5027 5.9697 17.5818 4.2075 20.4910 20.7403 0.1333 4.4399 0.5525
temp: 298.150 k
press: 1.00000 atm
elementType: 6 8 1 1 6 6 6 6 6 6 6 6 8 6 6 6 6 1 1 1 1 1 1 1 1 1 1 1 1 1 1
symmnumber: 1
zpe: 690387.1 jmol-1
zpe.correction: 0.262955 hartree
zpe.thermalcorrener: 0.276867 hartree
zpe.thermalcorrenthalpy: 0.277812 hartree
zpe.thermalcorrgfe: 0.224184 hartree
zpe.sumelectzpe: -654.027612 hartree
zpe.sumelectthermal: -654.013699 hartree
zpe.sumelectthermalent: -654.012755 hartree
zpe.sumelectthermalfe: -654.066382 hartree
dipole: 0.0000 -0.0001 4.7162
dipole: 4.7162
quadrupole: -80.9276 -103.4100 -89.7652
quadrupole: 10.5928 0.0001 -0.0002
quadrupole: 10.4400 -12.0424 1.6024 10.5928 0.0001 -0.0002
hfenergy: -654.2905667 hartree
pointgroup: C01 [X(C13H16O2)]
dipole: 1.1555041 1.432212 -0.2375301 debye
polarizability: 167.3823984|-2.5611426|167.9203603|-3.5311673|5.5477387|181.2062382 unknown
InChI: InChI=1S/C13H16O2/c1-10-5-11(2)7-9(15)12(10,3)6(10)8(14)13(7,11)4/h6-7H,5H2,1-4H3
charge 0 multiplicity 1
31 atoms
C  0.90412106 1.25950979 -0.31859161
O  -2.82009658 0.47833163 0.81166759
H  0.96421438 -1.61033297 1.66468057
H  -2.18456586 0.37550118 -1.67929061
C  -0.57521433 -0.00139511 1.39780427
C  -1.68711082 0.24950851 0.4320171
C  -1.33835959 0.2212962 -1.00476671
C  0.79233538 0.52050956 0.99408407
C  0.51856067 -0.95965944 0.90781644
C  0.39486218 -1.57347143 -0.43184954
C  -0.24982676 -0.74346524 -1.49367738
C  0.00945247 0.75103792 -1.42437617
O  0.80849957 -2.69388887 -0.66362599
C  0.11256226 1.54184238 -2.7029747
C  -1.00278026 -0.05235191 2.83931371
C  1.73331883 1.02383248 2.05805452
C  -0.43272782 -1.44915982 -2.8096943
H  0.67786279 2.32596954 -0.14655927
H  1.95272214 1.21232235 -0.65966838
H  -0.62560157 1.22739801 -3.45178574
H  -0.0549085 2.61059807 -2.49638015
H  1.11662016 1.43797603 -3.14453644
H  -1.84200672 -0.75273999 2.9596845
H  -0.18669843 -0.38005168 3.49544365
H  -1.34627738 0.93645793 3.17931288
H  1.71602081 0.4019297 2.96216586
H  2.76542931 1.02675639 1.67372917
H  1.47859551 2.05647409 2.34556893
H  -1.03547444 -0.85704816 -3.5096823
H  0.54074539 -1.65714927 -3.27918815
H  -0.93697384 -2.41393787 -2.6538958
