program: Gaussian 09
title: 000005400
version: EM64L-G09RevD.01
frameworkgroup: C1[X(C12H15NO)]
method: RPBEPBE
basis: SDD
operation: Freq
keyword: #p
keyword: freq=noraman
keyword: PBEPBE/SDD
title: #p freq=noraman PBEPBE/SDD
converged: YES YES NO NO
title: Mulliken charges:
elementType: O N C C C C C C C C C C C C H H H H H H H H H H H H H H H
charge: -0.192124 -0.084631 -0.200053 -0.576400 -0.403298 0.297013 -0.045201 0.177144 -0.391455 -0.374652 -0.620111 -0.615370 -0.213624 -0.229414 0.257933 0.232745 0.264778 0.227222 0.220334 0.245578 0.273406 0.228490 0.196726 0.221028 0.225651 0.221762 0.193742 0.228827 0.233956
chargesum: 0.00000
title: Mulliken charges with hydrogens summed into heavy atoms:
elementType: O N C C C C C C C C C C C C
charge: -0.192124 -0.084631 0.057880 -0.078878 0.044258 0.297013 -0.045201 0.177144 -0.145877 -0.101246 0.026132 0.025786 0.015203 0.004541
polarizability: 1.88414414e+02 -6.61560753e+00 1.39308121e+02 1.07438178e+01 4.88153725e+00 8.74221637e+01
1716.lowfreq: -14.1180 -3.8034 -0.0005 -0.0001 0.0006 5.1594 20.0751 35.9813 77.9994
frequency: 20.0429 35.6547 77.9941 119.3716 132.7472 201.0395 205.3625 227.2681 233.7162 261.6889 290.5290 369.0983 392.3129 431.7163 442.9514 470.9875 492.3289 542.8982 598.5480 628.6007 673.7911 722.8831 746.3706 781.6764 817.1067 847.9621 868.6190 883.9921 914.1031 965.9980 1000.5830 1012.2525 1023.4745 1032.3820 1035.7756 1055.8393 1082.7937 1088.4055 1091.9342 1123.6494 1144.9110 1166.0840 1175.1993 1190.6862 1206.6849 1227.7281 1262.1018 1265.4362 1276.7345 1296.6326 1310.9789 1359.7315 1397.7713 1418.4971 1440.7690 1447.9408 1453.6913 1460.1975 1464.2302 1469.9856 1475.5644 1478.8247 1486.8919 1593.7712 1607.7014 1626.0739 2857.4469 2866.6278 2882.3156 2994.8526 3002.7091 3018.4552 3019.2321 3027.5346 3046.9556 3076.7701 3082.2165 3124.2227 3137.4927 3149.1438 3164.6757
redmass: 3.7675 2.9313 2.7868 2.8583 5.4916 2.2420 1.7901 1.2150 2.1407 4.7164 2.8864 1.9454 2.8652 2.4999 2.9202 3.1497 3.6626 7.1620 4.1970 5.4727 4.8925 2.5463 2.9869 1.8625 4.6141 3.8156 1.7699 1.8091 1.5722 1.4078 1.3397 2.6871 2.2787 1.8029 2.0118 2.3819 1.7715 2.1294 1.4965 1.3333 1.5142 1.1882 1.5316 1.8441 1.6003 1.5988 2.3300 1.9284 2.3979 1.6304 1.3107 1.3260 7.3697 1.1403 1.1619 1.7738 1.9042 1.0514 1.1403 1.4467 1.0506 1.1026 1.0548 7.0438 8.0368 10.1387 1.0562 1.0589 1.0658 1.0694 1.0768 1.0818 1.0811 1.0730 1.1000 1.1012 1.1005 1.0861 1.0897 1.0947 1.1003
irintensity: 0.9192 1.0781 2.3710 0.0777 3.0644 1.5293 2.0047 0.4896 0.9873 4.6764 5.1235 4.4723 0.5746 5.5018 3.2252 3.4544 1.1507 1.5708 13.2930 10.3388 3.3640 14.2725 20.3635 52.2752 4.6897 10.1612 7.0820 9.3779 9.7057 1.8147 0.0482 18.4087 27.7583 20.8608 3.5348 34.5730 49.3339 13.4564 17.8148 14.4949 5.8901 3.9298 21.6922 7.3689 5.7283 17.5126 31.2769 3.3719 67.9298 5.6396 4.1633 18.0841 7.9241 3.9734 5.1352 3.6289 37.2552 16.3767 8.3972 4.4633 16.5720 12.2858 12.1546 17.3870 146.7952 119.4195 69.1702 133.4723 138.8964 11.8352 2.3716 15.8577 57.2419 38.0757 16.1632 24.8902 59.2732 1.5141 9.4091 18.1487 30.7477
temp: 298.150 k
press: 1.00000 atm
elementType: 8 7 6 6 6 6 6 6 6 6 6 6 6 6 1 1 1 1 1 1 1 1 1 1 1 1 1 1 1
symmnumber: 1
zpe: 634618.4 jmol-1
zpe.correction: 0.241713 hartree
zpe.thermalcorrener: 0.254996 hartree
zpe.thermalcorrenthalpy: 0.255940 hartree
zpe.thermalcorrgfe: 0.200547 hartree
zpe.sumelectzpe: -595.201290 hartree
zpe.sumelectthermal: -595.188007 hartree
zpe.sumelectthermalent: -595.187063 hartree
zpe.sumelectthermalfe: -595.242457 hartree
dipole: -0.2002 -3.1761 -0.0138
dipole: 3.1825
quadrupole: -68.6270 -91.0085 -82.7877
quadrupole: -1.9043 1.7148 0.9362
quadrupole: 12.1807 -10.2008 -1.9800 -1.9043 1.7148 0.9362
hfenergy: -595.4430037 hartree
pointgroup: C01 [X(C12H15N1O1)]
dipole: 0.0805971 1.2415772 0.1402885 debye
polarizability: 187.7456771|-5.1852524|139.7125523|-14.148919|1.4694096|87.6864692 unknown
InChI: InChI=1S/C12H15NO/c1-13(2)8-10-7-9-5-3-4-6-11(9)12(10)14/h3-6,10H,7-8H2,1-2H3
charge 0 multiplicity 1
29 atoms
O  -0.00706 -2.558647 -0.424501
N  3.219971 0.496598 0.139093
C  0.956938 -0.26945 -0.689633
C  0.279076 1.126667 -0.576817
C  2.123913 -0.481147 0.314218
C  -1.16452 0.836657 -0.186228
C  -0.159166 -1.305615 -0.409353
C  -1.405063 -0.558467 -0.097469
C  -2.21409 1.742757 0.075528
C  -2.674887 -1.077825 0.246573
C  3.975153 0.314565 -1.116803
C  4.112606 0.549558 1.316325
C  -3.488339 1.231596 0.42102
C  -3.721033 -0.168498 0.506639
H  1.33484 -0.452975 -1.713706
H  0.326844 1.685173 -1.530502
H  0.803503 1.750698 0.170085
H  2.472077 -1.539793 0.220287
H  1.729014 -0.358531 1.341932
H  -2.051049 2.824878 0.013956
H  -2.824185 -2.161323 0.303815
H  3.305181 0.418134 -1.987844
H  4.479039 -0.68272 -1.185536
H  4.750216 1.097438 -1.19614
H  3.521455 0.772379 2.222525
H  4.853898 1.358156 1.183929
H  4.671539 -0.40369 1.494452
H  -4.311722 1.925602 0.626486
H  -4.717653 -0.535473 0.775168
