program: Gaussian 09
title: 000041233
version: EM64L-G09RevD.01
frameworkgroup: C1[X(C12H13NS2)]
method: RPBEPBE
basis: SDD
operation: Freq
keyword: #p
keyword: freq=noraman
keyword: PBEPBE/SDD
title: #p freq=noraman PBEPBE/SDD
converged: YES YES NO NO
title: Mulliken charges:
elementType: S S N C C C C C C C C C C C C H H H H H H H H H H H H H
charge: 0.229543 0.212013 -0.413564 -0.688482 0.581523 0.137359 -0.631222 -0.625644 -0.635444 0.221461 -0.410071 -0.372154 -0.363555 -0.266723 -0.214522 0.264560 0.261791 0.261120 0.266183 0.243143 0.226482 0.224724 0.267967 0.306351 0.250853 0.226835 0.218843 0.220629
chargesum: 0.00000
title: Mulliken charges with hydrogens summed into heavy atoms:
elementType: S S N C C C C C C C C C C C C
charge: 0.229543 0.212013 -0.107212 -0.688482 0.581523 0.137359 -0.104871 -0.098341 0.058904 0.221461 -0.142104 -0.121301 -0.136720 -0.047880 0.006107
polarizability: 2.12052154e+02 5.44885610e+00 1.81757001e+02 -6.03052190e-01 1.40903062e+00 1.08637015e+02
1716.lowfreq: -10.3244 -0.0008 0.0005 0.0015 5.1170 12.2330 40.2099 45.2383 78.9880
frequency: 40.0850 45.0201 78.9392 119.7623 178.5648 220.3383 229.3441 252.0863 288.0448 292.8917 302.6076 348.5357 363.7556 418.8592 421.9286 437.4069 489.4643 514.8517 570.2512 573.3719 593.7401 609.0159 625.2963 639.6853 678.6105 741.3408 746.8812 762.1907 769.5411 810.2917 849.4621 851.5077 867.9027 931.6164 950.0073 971.8969 996.9137 1005.4708 1011.4927 1058.2948 1065.2938 1100.1853 1105.2273 1123.2549 1140.3128 1150.7748 1167.0711 1245.0030 1258.1061 1260.3680 1290.1443 1297.1032 1339.5944 1387.6366 1389.7905 1420.3613 1429.0203 1443.4259 1455.2316 1460.0281 1467.7140 1483.4560 1540.9228 1587.1047 1631.6952 2981.1483 3017.5805 3025.1781 3075.1468 3086.5950 3103.1228 3103.8858 3124.7331 3136.9055 3156.0157 3175.4827 3232.7342 3612.3014
redmass: 5.0495 3.6703 6.2150 6.9179 4.8071 4.0095 2.1351 6.3336 1.5101 2.6368 1.8645 7.9007 7.7258 5.3110 3.0090 3.6756 4.7044 1.2690 6.2441 3.0633 3.6275 5.4689 6.3205 3.6323 3.0105 3.9700 1.4085 4.7999 2.7291 1.5910 1.5517 1.6063 5.1011 1.3911 1.4502 1.3108 4.9155 2.3999 2.0930 1.5321 2.1423 1.7167 1.0517 1.8559 1.4105 1.5629 1.1488 1.5631 2.3369 1.3377 1.1764 2.5183 2.4523 2.5293 1.4885 2.5571 1.0872 1.0981 3.6844 1.0644 1.0527 3.0127 5.4034 6.3340 7.0784 1.0364 1.0547 1.0590 1.1001 1.1071 1.0984 1.1082 1.0853 1.0906 1.0966 1.0968 1.0978 1.0809
irintensity: 0.8166 2.3746 2.5099 1.2702 0.0238 7.3107 2.2805 0.8913 1.0344 0.3670 0.0822 0.5552 1.8700 6.3433 8.6751 0.4615 7.5776 85.1335 5.3607 6.0461 28.7603 8.4169 4.9640 0.6417 4.8470 26.2942 95.0505 3.7823 27.4030 4.9916 0.7074 7.6715 2.7978 1.1657 6.4231 0.2827 7.3459 6.3376 12.8254 20.7148 32.0855 7.6938 1.8011 45.4334 0.4204 2.6287 0.0223 18.5491 0.9477 4.4142 12.9396 5.2065 12.3740 75.1809 3.1516 10.6790 10.1770 4.8221 22.6972 8.1204 9.3424 0.9383 49.2838 1.4097 2.7801 22.0641 19.0764 48.6914 18.9537 1.0954 17.8717 25.4510 0.3441 18.2545 37.8704 12.8152 0.4012 71.4620
temp: 298.150 k
press: 1.00000 atm
elementType: 16 16 7 6 6 6 6 6 6 6 6 6 6 6 6 1 1 1 1 1 1 1 1 1 1 1 1 1
symmnumber: 1
zpe: 578555.5 jmol-1
zpe.correction: 0.220360 hartree
zpe.thermalcorrener: 0.234071 hartree
zpe.thermalcorrenthalpy: 0.235015 hartree
zpe.thermalcorrgfe: 0.179588 hartree
zpe.sumelectzpe: -1314.875337 hartree
zpe.sumelectthermal: -1314.861626 hartree
zpe.sumelectthermalent: -1314.860681 hartree
zpe.sumelectthermalfe: -1314.916109 hartree
dipole: 0.0577 1.8045 -0.1725
dipole: 1.8136
quadrupole: -85.2698 -86.5495 -114.3846
quadrupole: 10.9944 0.8957 0.5105
quadrupole: 10.1315 8.8518 -18.9833 10.9944 0.8957 0.5105
hfenergy: -1315.0956968 hartree
pointgroup: C01 [X(C12H13N1S2)]
dipole: -0.0289553 -0.7093161 0.0719352 debye
polarizability: 211.0968727|-7.5688869|182.7098427|1.4905819|0.8588967|108.6394547 unknown
InChI: InChI=1S/C12H13NS2/c1-12(14-6-7-15-12)10-8-13-11-5-3-2-4-9(10)11/h2-5,8,13H,6-7H2,1H3
charge 0 multiplicity 1
28 atoms
S  -2.101448 0.454131 1.515744
S  -2.119652 0.433262 -1.588885
N  1.807105 -2.07291 -0.00732
C  -1.634147 -0.628015 -0.010534
C  -0.160382 -0.905135 0.001451
C  0.946873 0.04598 0.02021
C  -3.555314 1.287884 0.654089
C  -3.055798 1.814383 -0.695059
C  -2.508845 -1.895323 -0.025979
C  2.165569 -0.717311 0.014998
C  0.41452 -2.181397 -0.016001
C  1.031344 1.462855 0.036897
C  3.443832 -0.117583 0.028472
C  2.301604 2.070334 0.048242
C  3.495895 1.290415 0.045078
H  -3.884511 2.106663 1.317383
H  -4.377259 0.563388 0.530038
H  -3.896008 2.103071 -1.350775
H  -2.376641 2.671568 -0.558755
H  -3.577316 -1.628088 0.002933
H  -2.334687 -2.475429 -0.951489
H  -2.285109 -2.530371 0.850776
H  -0.06776 -3.155931 -0.034498
H  2.457561 -2.855069 -0.015053
H  0.119547 2.065457 0.048016
H  4.361403 -0.716595 0.025758
H  2.379326 3.163164 0.061912
H  4.468899 1.794303 0.056051
