program: Gaussian 16
title: Title Card Required
version: ES64L-G16RevC.01
frameworkgroup: C1[X(C13H16O2)]
method: RPBE1PBE
basis: def2SVP
operation: Freq
keyword: #P
keyword: Geom=AllCheck
keyword: Guess=TCheck
keyword: SCRF=Check
keyword: GenChk
keyword: RPBE1PBE/def2SVP
keyword: Freq
converged: YES YES NO YES
title: Mulliken charges:
elementType: C C C C C C C C C H O O H H C C C C H H H H H H H H H H H H H
charge: -0.061479 0.181965 -0.134567 -0.302538 -0.211146 0.032652 -0.162288 -0.085846 0.206689 0.033359 -0.247156 -0.232553 0.064839 0.063211 0.046576 0.072910 0.033282 0.006784 0.021743 0.061527 0.058786 0.049201 0.053312 0.055182 0.044486 0.050265 0.064597 0.060155 0.056090 0.058192 0.061771
chargesum: 0.00000
title: Mulliken charges with hydrogens summed into heavy atoms:
elementType: C C C C C C C C C O O C C C C
charge: 0.003360 0.181965 -0.071356 -0.302538 -0.211146 0.054395 -0.162288 -0.052487 0.206689 -0.247156 -0.232553 0.216090 0.225890 0.208300 0.182836
polarizability: 1.90334219e+02 1.05801975e+00 1.64412855e+02 -9.95854082e+00 2.87186874e+00 1.65503201e+02
1716.lowfreq: -4.3404 -0.0008 0.0010 0.0011 9.7622 16.2738 59.2264 107.8003 119.4600
frequency: 59.2152 107.7818 119.4527 131.2552 141.6745 180.3479 189.7341 218.4785 232.6950 250.8877 268.3134 284.0226 310.1058 313.5673 345.3772 410.8475 450.4784 462.8283 483.3832 497.3881 522.5832 558.0803 621.0850 639.0133 701.7081 737.7617 778.3070 795.5517 842.3180 857.1867 881.0689 936.6537 940.9013 969.0647 993.0293 996.7103 1010.9369 1022.4366 1048.6116 1069.4281 1091.5424 1092.7400 1111.0726 1137.2457 1153.9306 1204.9286 1215.7822 1239.4324 1249.3778 1278.8999 1306.6654 1332.7148 1344.3163 1364.2972 1366.9319 1381.4524 1394.1534 1397.2992 1409.5320 1430.9947 1436.2846 1438.5676 1440.4534 1447.3924 1450.3142 1453.7786 1459.5578 1479.7352 1767.1187 1834.0990 1842.2710 3041.8082 3058.9672 3061.5749 3070.4175 3088.9751 3119.4514 3121.8465 3148.1283 3154.8437 3159.6192 3164.7331 3170.5279 3180.6466 3187.5753 3194.3270 3195.1294
redmass: 5.2015 5.8299 3.2402 2.8743 1.2023 1.2679 1.1314 1.5204 1.5648 1.9224 2.2598 2.6422 3.4331 2.7684 3.7877 5.1857 4.8970 4.0759 5.7694 3.8825 3.7779 4.1931 3.2557 4.8362 3.7669 3.7076 3.0780 3.2153 3.1302 1.7082 1.9729 2.0305 2.1929 1.5851 1.6020 1.6895 1.5707 1.5949 1.5588 1.7490 1.6234 1.6036 2.7107 2.2171 2.4075 2.2347 1.9530 1.9888 1.5471 1.5941 2.0392 2.0829 1.8755 1.6614 1.8770 1.2852 1.3273 1.8426 2.0862 1.0429 1.1293 1.2052 1.1442 1.1413 1.0507 1.1332 1.0759 2.1717 8.1004 12.0104 12.2017 1.0390 1.0369 1.0390 1.0383 1.0859 1.1018 1.0881 1.1042 1.1042 1.1040 1.1041 1.1049 1.1043 1.1019 1.0929 1.0922
irintensity: 8.3797 1.8746 1.7723 2.0941 0.4735 0.2012 0.6884 1.0277 0.0877 1.8675 0.8707 0.3235 0.9763 2.7012 9.2322 7.1297 7.4729 9.8093 4.0006 9.7530 6.1120 0.8399 3.9840 7.3562 3.0425 5.5561 4.8073 0.0946 3.6823 11.9483 66.6684 18.8696 16.5914 9.2919 5.6234 17.7384 7.3903 1.4868 4.1930 45.7302 32.3644 15.3549 4.7173 4.7467 4.1602 3.8001 31.7122 15.6126 29.7381 51.1565 13.8137 46.0032 22.1625 9.3657 16.4355 9.5263 2.3545 14.2099 20.4066 12.2869 13.3993 4.1492 9.4284 29.8889 9.8019 20.7390 10.9772 34.1993 29.2205 476.8064 257.9637 26.9611 20.8649 25.1075 28.1131 9.4134 10.2908 16.8303 13.7544 17.5049 12.1480 14.9926 9.8283 8.7112 11.3862 13.3634 3.0028
temp: 298.150 k
press: 1.00000 atm
elementType: 6 6 6 6 6 6 6 6 6 1 8 8 1 1 6 6 6 6 1 1 1 1 1 1 1 1 1 1 1 1 1
symmnumber: 1
zpe: 688162.1 jmol-1
zpe.correction: 0.262107 hartree
zpe.thermalcorrener: 0.276471 hartree
zpe.thermalcorrenthalpy: 0.277415 hartree
zpe.thermalcorrgfe: 0.222322 hartree
zpe.sumelectzpe: -654.014104 hartree
zpe.sumelectthermal: -653.999740 hartree
zpe.sumelectthermalent: -653.998796 hartree
zpe.sumelectthermalfe: -654.053889 hartree
dipole: -0.9478 2.3695 0.3367
dipole: 2.5741
quadrupole: -78.3654 -85.8242 -107.8031
quadrupole: 2.9862 -6.0476 2.8691
quadrupole: 12.2988 4.8400 -17.1389 2.9862 -6.0476 2.8691
hfenergy: -654.2762109 hartree
pointgroup: C01 [X(C13H16O2)]
dipole: 0.980025 0.1708106 -0.1896947 debye
polarizability: 174.7622785|-3.5346755|161.0601633|13.1070539|-1.1526224|184.4278326 unknown
InChI: InChI=1S/C13H16O2/c1-6-5-12(3)10-9(14)7(2)8(6)11(15)13(10,12)4/h5,7-8,10H,1-4H3
charge 0 multiplicity 1
31 atoms
C  0.14028744 -0.67948266 1.26544043
C  -0.56772256 -1.42576711 0.19099771
C  -1.13897119 -0.63837291 -0.97979595
C  0.06807149 0.84339067 1.35008159
C  1.37584865 0.16018318 0.96735285
C  1.82733246 0.28735589 -0.44866563
C  0.99145571 0.58317237 -1.45306584
C  -0.47228446 0.74793612 -1.11586893
C  -0.62162762 1.48547984 0.19715385
H  -0.99371378 1.32726111 -1.89088426
O  -0.7348589 -2.62390477 0.27597489
O  -1.25912449 2.51075909 0.30716103
H  0.16939481 -1.21740861 2.2172572
H  -0.91968835 -1.22672654 -1.88557823
C  2.49982661 0.11297581 1.97229814
C  -0.1233359 1.52382521 2.67641836
C  1.38954847 0.69008701 -2.88616504
C  -2.65548732 -0.54526659 -0.81538025
H  2.8901374 0.11356088 -0.64220421
H  3.19352606 -0.70333632 1.71727002
H  3.06916805 1.05587739 1.95636489
H  2.14329577 -0.0581539 2.99577395
H  -1.19539418 1.68582497 2.86288127
H  0.36681197 2.50920848 2.68500542
H  0.28105629 0.92815377 3.50461131
H  2.46085605 0.48802887 -3.02814539
H  1.16781132 1.69649221 -3.28000745
H  0.81787553 -0.02156018 -3.50642979
H  -2.93472344 -0.00352207 0.10234698
H  -3.09381054 -1.55208199 -0.76253891
H  -3.10166138 -0.01528924 -1.67036001
