program: Gaussian 16
title: Title Card Required
version: ES64L-G16RevC.01
frameworkgroup: C1[X(C13H16O2)]
method: RPBE1PBE
basis: def2SVP
operation: Freq
keyword: #P
keyword: Geom=AllCheck
keyword: Guess=TCheck
keyword: SCRF=Check
keyword: GenChk
keyword: RPBE1PBE/def2SVP
keyword: Freq
converged: YES YES NO YES
title: Mulliken charges:
elementType: C C C C C C C C C O H H O H H C C C C H H H H H H H H H H H H
charge: -0.179616 0.176517 -0.081669 -0.244909 -0.037162 -0.075245 -0.048873 -0.241671 0.149345 -0.238726 0.071865 0.067994 -0.251549 0.094760 0.031996 0.076307 0.020435 0.027151 0.020385 0.055333 0.051623 0.044345 0.048180 0.060298 0.056693 0.050343 0.055178 0.049075 0.055402 0.068904 0.067291
chargesum: -0.00000
title: Mulliken charges with hydrogens summed into heavy atoms:
elementType: C C C C C C C C C O O C C C C
charge: -0.084855 0.176517 -0.013676 -0.244909 -0.005166 -0.003380 -0.048873 -0.241671 0.149345 -0.238726 -0.251549 0.227609 0.185605 0.181748 0.211982
polarizability: 1.76401578e+02 -1.41954508e+01 1.86411242e+02 2.45646107e+00 -1.40684006e+01 1.62628717e+02
1716.lowfreq: -13.4408 -10.8686 -9.5870 0.0010 0.0011 0.0014 44.6596 55.8989 68.5067
frequency: 44.4136 55.8362 68.4946 101.9023 117.0075 133.9866 157.7929 216.8845 228.4030 241.7671 268.1457 276.5678 320.7931 339.4390 377.9431 395.0422 406.9512 441.6052 507.3465 533.8025 556.6376 589.1177 613.1711 636.0141 668.5841 719.8606 797.1791 812.0704 839.6620 873.1812 901.1339 930.1696 945.0024 960.5502 977.9261 1010.7062 1017.7112 1048.9675 1053.9996 1072.0447 1091.0267 1100.8096 1121.0460 1139.5836 1165.6038 1183.5007 1191.0260 1224.5638 1242.2926 1271.1339 1302.8053 1319.0097 1329.8719 1343.9004 1358.5042 1382.2014 1387.5361 1391.0742 1413.6699 1426.6953 1431.4361 1437.4712 1440.8052 1446.8450 1448.3917 1452.2260 1461.7319 1523.8414 1724.8277 1802.8776 1865.1212 3035.2870 3050.1259 3051.2477 3057.2496 3066.2214 3123.8271 3131.8014 3139.0923 3143.3980 3156.7738 3159.1203 3160.7456 3170.8542 3189.7092 3195.9143 3210.0664
redmass: 1.0698 3.9963 5.2937 2.9809 1.1168 3.7970 2.8576 1.0870 1.0612 2.4775 2.8394 3.4216 3.4182 2.5773 4.1648 4.7140 4.8147 4.7736 3.3415 3.9015 4.7171 3.7623 5.1685 3.5745 3.9782 3.1033 3.8326 2.3337 2.8044 2.6594 1.8350 1.5159 1.6966 2.0630 1.4265 1.5680 1.5290 1.6809 1.7811 1.7678 1.8490 1.8651 2.1152 2.1174 1.9139 1.8696 2.3753 1.7287 1.8925 1.7931 1.6248 2.5767 2.3082 2.0873 1.7855 1.2881 1.3952 1.4208 2.2384 1.1577 1.0600 1.0600 1.0439 1.0634 1.0768 1.0896 1.0601 5.2108 8.5349 12.1467 12.5885 1.0835 1.0415 1.0375 1.0434 1.0375 1.1010 1.0884 1.0972 1.1045 1.1042 1.0891 1.1037 1.1047 1.1040 1.1006 1.0934
irintensity: 0.8108 3.9984 7.5232 1.1130 0.3703 3.7494 0.2750 1.2660 0.2510 3.5931 1.8142 1.6182 11.5577 2.5879 3.0387 11.0761 2.9060 4.1679 7.2759 2.9817 3.3235 2.6515 4.1542 10.4538 6.5993 6.4849 3.3931 3.2315 26.6829 12.1988 3.2125 43.0979 13.0072 12.1949 2.1838 14.9428 1.1139 1.4237 10.0162 7.5765 26.6096 23.1284 14.5164 16.6984 17.9947 4.8533 26.9351 14.8963 5.8938 29.1164 7.6113 11.3829 14.6380 7.6755 57.2752 12.6428 8.9375 4.6970 107.4759 13.8684 17.7694 14.4605 5.7990 22.6876 4.5017 17.5579 9.1610 35.9393 88.9890 434.2797 387.5299 8.4121 13.7795 35.0341 21.0887 18.1660 5.9085 15.4879 9.7180 18.6096 15.7127 8.6703 17.2085 7.9535 3.5925 17.4935 2.1550
temp: 298.150 k
press: 1.00000 atm
elementType: 6 6 6 6 6 6 6 6 6 8 1 1 8 1 1 6 6 6 6 1 1 1 1 1 1 1 1 1 1 1 1
symmnumber: 1
zpe: 686182.0 jmol-1
zpe.correction: 0.261353 hartree
zpe.thermalcorrener: 0.276132 hartree
zpe.thermalcorrenthalpy: 0.277076 hartree
zpe.thermalcorrgfe: 0.219804 hartree
zpe.sumelectzpe: -654.014044 hartree
zpe.sumelectthermal: -653.999265 hartree
zpe.sumelectthermalent: -653.998321 hartree
zpe.sumelectthermalfe: -654.055593 hartree
dipole: 1.4962 -3.3312 -1.3147
dipole: 3.8813
quadrupole: -87.7546 -84.1481 -100.1978
quadrupole: 4.5079 -12.5717 2.8523
quadrupole: 2.9456 6.5521 -9.4976 4.5079 -12.5717 2.8523
hfenergy: -654.2753965 hartree
pointgroup: C01 [X(C13H16O2)]
dipole: -0.0660736 0.5752001 1.412993 debye
polarizability: 169.249171|-3.2538258|164.6537126|-15.7915694|-9.016443|191.5386534 unknown
InChI: InChI=1S/C13H16O2/c1-5-6(2)11(14)9-7(3)12(15)10-8(5)13(9,10)4/h7-10H,1-4H3
charge 0 multiplicity 1
31 atoms
C  -1.97135277 -0.12200996 -0.95056727
C  -2.49238332 -0.83326868 0.28845118
C  -2.13419896 -0.01842255 1.48409734
C  -1.19466666 1.0838093 1.04602762
C  -0.89122534 0.87029822 -0.444645
C  -0.66018894 -0.02111204 1.88208914
C  0.32637833 -1.00664298 1.36387009
C  0.93340759 -0.81612292 0.1648833
C  0.49156035 0.306389 -0.69877138
O  -3.14246923 -1.85175714 0.28563159
H  -0.5243269 0.20339504 2.9463946
H  -2.87266064 0.09290039 2.28198029
O  1.1587357 0.68629287 -1.64408618
H  -2.83504947 0.51261735 -1.2298517
H  -0.95416462 1.81681477 -0.99757224
C  -1.28491513 2.48809629 1.56678064
C  2.03357837 -1.65606824 -0.40185177
C  -1.6427036 -1.03316568 -2.11453285
C  0.60041494 -2.14424343 2.29028415
H  -0.32708891 3.01678485 1.43655361
H  -2.06127662 3.0577042 1.03138569
H  -1.53311837 2.49586952 2.63895437
H  2.47171904 -2.34224275 0.3328084
H  1.6772208 -2.25222251 -1.2593874
H  2.8280835 -1.00247274 -0.79165599
H  -1.34907848 -0.45622291 -3.00330041
H  -2.52325472 -1.64062269 -2.36888716
H  -0.82249784 -1.7257087 -1.87135784
H  1.31408282 -2.87473805 1.89160715
H  -0.34493876 -2.66895518 2.50997358
H  0.97907785 -1.77307265 3.25769444
