program: Gaussian 16
title: Title Card Required
version: ES64L-G16RevC.01
frameworkgroup: C1[X(C13H16O2)]
method: RPBE1PBE
basis: def2SVP
operation: Freq
keyword: #P
keyword: Geom=AllCheck
keyword: Guess=TCheck
keyword: SCRF=Check
keyword: GenChk
keyword: RPBE1PBE/def2SVP
keyword: Freq
converged: YES YES YES YES
title: Mulliken charges:
elementType: C C C C C C O H C C C O H H C C C C H H H H H H H H H H H H H
charge: -0.160344 -0.067515 -0.036412 0.008826 -0.112455 0.105525 -0.235722 0.082239 0.144892 -0.163342 -0.174303 -0.249691 0.029711 0.022475 0.038636 0.014601 -0.004525 0.014177 0.041441 0.063083 0.050680 0.062018 0.047167 0.055815 0.058635 0.057351 0.050496 0.056083 0.057183 0.074304 0.068970
chargesum: -0.00000
title: Mulliken charges with hydrogens summed into heavy atoms:
elementType: C C C C C C O C C C O C C C C
charge: -0.160344 -0.026074 -0.013937 0.038537 -0.030216 0.105525 -0.235722 0.144892 -0.163342 -0.174303 -0.249691 0.214417 0.176218 0.159405 0.214634
chargesum: 0.00000
polarizability: 1.78932230e+02 8.93800008e+00 2.00993582e+02 3.40762015e+00 2.33603622e+01 1.58642215e+02
1716.lowfreq: -4.8738 -0.0001 0.0006 0.0012 10.4589 14.7867 52.3105 65.6537 76.6062
frequency: 52.1754 65.5784 76.5328 102.9163 112.3031 123.5751 161.7698 202.4987 233.3081 253.6070 262.8541 293.8541 330.8531 355.1413 361.4909 384.6061 397.9524 419.9192 470.9192 493.8447 515.7815 558.8854 596.0514 668.0377 723.5812 728.6123 755.7401 795.3117 804.8977 843.3237 892.0015 941.6347 959.5559 970.6738 1002.1664 1012.6803 1032.5169 1047.9734 1052.1870 1066.2487 1098.1935 1111.4627 1122.4416 1131.6118 1181.9350 1199.5700 1202.4829 1254.0559 1255.7743 1277.3706 1309.6376 1331.1312 1340.6853 1356.8213 1366.8380 1376.5784 1381.8954 1396.7347 1407.6739 1426.5039 1430.6280 1432.1253 1437.8813 1438.2522 1451.0268 1454.1403 1460.5465 1707.0345 1762.5062 1786.1469 1853.8089 3043.4967 3049.1921 3059.5511 3064.6632 3069.2386 3122.0483 3122.9131 3129.8413 3143.7000 3147.7211 3157.0432 3165.6029 3171.6722 3195.3182 3205.6380 3208.7325
redmass: 5.5880 5.0106 1.1303 3.0037 2.8502 3.4272 1.0427 1.0947 1.3097 2.4995 2.1246 3.1596 3.4236 3.7916 3.3486 2.9058 4.3315 5.5980 4.4210 4.3715 3.8917 3.8195 4.6512 3.4102 3.8157 3.5583 4.3134 2.7590 3.9215 1.5458 2.0039 2.4253 1.8907 1.5410 1.5319 1.5079 1.6318 1.6189 1.6670 1.9928 1.9443 1.9980 2.0589 3.9549 2.2249 2.3880 2.6062 1.5986 1.3875 1.4420 1.8508 2.3994 1.7562 1.4379 1.5000 1.2674 1.2770 1.8226 2.2937 1.1120 1.0442 1.0541 1.0537 1.0622 1.0468 1.0783 1.0648 7.7879 7.9069 11.4497 12.2790 1.0386 1.0420 1.0373 1.0433 1.0839 1.1009 1.1018 1.0878 1.0985 1.0881 1.1045 1.1047 1.1049 1.1037 1.0993 1.0951
irintensity: 6.7791 4.4075 0.7247 0.9272 0.6463 1.1067 1.5992 0.7468 0.4567 0.2915 1.7083 1.0253 6.4846 5.0603 1.7267 2.7853 13.5222 6.7141 8.1639 1.6845 12.0186 8.5960 1.6724 10.2268 15.3201 2.8295 3.3846 20.1424 6.1131 35.6299 27.7961 6.3942 8.3490 3.6042 3.7748 1.0863 5.4227 2.9732 0.2461 11.5156 45.4897 3.0604 3.8510 91.8102 26.0706 32.5634 6.3756 5.7143 16.4243 4.4539 6.4466 39.0991 27.9398 20.8735 3.2976 11.0292 20.0634 22.1576 68.6574 13.5078 13.8023 12.2208 15.2668 17.3159 12.1718 11.1716 8.4846 91.8690 61.0455 426.8753 367.9119 21.1220 9.1099 25.7770 22.4468 9.1883 3.7352 8.3879 13.8857 9.0610 12.1211 18.4365 14.3881 9.4410 3.3038 20.5336 6.8750
temp: 298.150 k
press: 1.00000 atm
elementType: 6 6 6 6 6 6 8 1 6 6 6 8 1 1 6 6 6 6 1 1 1 1 1 1 1 1 1 1 1 1 1
symmnumber: 1
zpe: 687394.8 jmol-1
zpe.correction: 0.261815 hartree
zpe.thermalcorrener: 0.276654 hartree
zpe.thermalcorrenthalpy: 0.277598 hartree
zpe.thermalcorrgfe: 0.220447 hartree
zpe.sumelectzpe: -654.009109 hartree
zpe.sumelectthermal: -653.994270 hartree
zpe.sumelectthermalent: -653.993326 hartree
zpe.sumelectthermalfe: -654.050477 hartree
dipole: -0.1674 0.4825 2.3734
dipole: 2.4278
quadrupole: -80.6127 -105.2412 -85.9435
quadrupole: 8.7921 1.2756 -0.2962
quadrupole: 9.9864 -14.6420 4.6556 8.7921 1.2756 -0.2962
hfenergy: -654.2709238 hartree
pointgroup: C01 [X(C13H16O2)]
dipole: -0.3926373 0.7549789 0.4337852 debye
polarizability: 169.0333728|22.01895|192.3104639|20.1506406|7.4549836|177.2241903 unknown
InChI: InChI=1S/C13H16O2/c1-6-5-10-7(2)8(3)13(15)11(6)9(4)12(10)14/h5,9-11H,1-4H3
charge 0 multiplicity 1
31 atoms
C  -1.05386449 1.0137729 -0.37035287
C  -0.46138461 1.86918531 0.46988438
C  -0.18638652 -0.12418691 -0.8699522
C  0.98037936 1.64198657 0.83969653
C  1.15611177 0.4062015 -1.40236756
C  1.77395473 1.4116462 -0.44893789
O  2.80808597 1.98866354 -0.68113682
H  1.87558243 -0.42881458 -1.46820982
C  -0.0226756 -1.13791177 0.25222767
C  0.76537404 -0.80509641 1.47148748
C  1.2555885 0.43860971 1.72600129
O  -0.51792246 -2.24493392 0.13201877
H  1.40497721 2.53056642 1.32130303
H  -0.69850327 -0.66996854 -1.6732556
C  -2.47249001 1.0809944 -0.81933648
C  0.97537271 -1.9871163 2.37132014
C  1.01643344 1.0238935 -2.78944844
C  2.16281252 0.76224502 2.8679332
H  -0.97963776 2.74003903 0.88084021
H  -3.00576113 0.15238486 -0.55346314
H  -3.00501026 1.930448 -0.36819402
H  -2.53096579 1.17064963 -1.91733998
H  1.40559768 -1.71696123 3.34205512
H  0.01545434 -2.49506447 2.54519971
H  1.63327786 -2.73420056 1.89661103
H  1.98215165 1.43263114 -3.119516
H  0.28153194 1.84434479 -2.78486977
H  0.68857334 0.26909517 -3.51917093
H  2.4732668 -0.10871859 3.45522979
H  1.68222167 1.49211944 3.54181841
H  3.06985394 1.25569616 2.47912476
