program: Gaussian 16
title: Title Card Required
version: ES64L-G16RevC.01
frameworkgroup: C1[X(C13H16O2)]
method: RPBE1PBE
basis: def2SVP
operation: Freq
keyword: #P
keyword: Geom=AllCheck
keyword: Guess=TCheck
keyword: SCRF=Check
keyword: GenChk
keyword: RPBE1PBE/def2SVP
keyword: Freq
converged: YES YES YES YES
title: Mulliken charges:
elementType: C C C C C C C C H C O O H C C C C H H H H H H H H H H H H H H
charge: -0.417334 -0.084555 0.280890 -0.093384 -0.265846 0.216331 -0.104293 -0.062331 0.046544 -0.082879 -0.200964 -0.217733 0.077079 0.088808 0.016639 0.037609 0.059831 0.039613 0.033172 0.057214 0.052844 0.048483 0.052448 0.048761 0.046709 0.049874 0.064841 0.063834 0.044666 0.050930 0.052198
chargesum: -0.00000
title: Mulliken charges with hydrogens summed into heavy atoms:
elementType: C C C C C C C C C O O C C C C
charge: -0.417334 -0.038011 0.280890 -0.053771 -0.265846 0.216331 -0.027214 -0.062331 -0.049707 -0.200964 -0.217733 0.247348 0.164558 0.216158 0.207625
chargesum: 0.00000
polarizability: 1.83886248e+02 8.62003942e+00 1.64119801e+02 8.40272134e+00 3.88178627e+00 1.68061743e+02
1716.lowfreq: -0.0008 -0.0004 0.0006 6.2772 9.7195 14.3770 85.9746 104.9296 115.7465
frequency: 85.9632 104.9289 115.7416 147.1302 182.5454 209.9732 224.5209 225.6351 233.7496 245.5701 249.5019 257.7534 294.1259 327.5787 373.0736 392.5922 449.2603 466.6298 512.4026 518.1452 539.6713 558.9910 575.2950 630.3726 690.8678 764.6075 805.9393 832.3768 858.7812 872.4581 886.1417 904.4066 932.4608 971.0006 996.9852 1005.2577 1029.6165 1044.5521 1050.9206 1064.4721 1082.7384 1102.0931 1112.4011 1129.4637 1143.9352 1171.6529 1185.0543 1200.7025 1202.5656 1231.7287 1259.6973 1262.0149 1304.9982 1325.4963 1348.2486 1354.8637 1387.7104 1389.1582 1391.2168 1396.4797 1431.2787 1438.8602 1445.6674 1446.4158 1448.8043 1453.9415 1455.2968 1456.2981 1747.6299 1878.8497 1915.5769 3006.6750 3044.0807 3052.5544 3055.7871 3064.1928 3123.5256 3128.6062 3150.7268 3151.0492 3152.2508 3152.7372 3161.0880 3161.6152 3163.9427 3167.0310 3199.1414
redmass: 5.3401 3.0645 6.8776 4.4096 1.0796 1.1340 1.9510 1.7627 1.4795 1.8559 1.7311 1.4624 3.9675 3.3287 4.0028 3.0595 4.9704 4.5805 3.9473 3.4203 4.6191 4.0798 4.3200 2.9187 3.0244 3.1347 3.4096 2.6605 1.5903 2.1765 1.8684 1.9239 2.4069 1.9329 1.9358 1.5340 1.9853 2.0778 1.6729 1.5229 2.1957 2.0176 1.7120 1.7053 1.9748 1.9158 3.1223 1.8451 1.5714 2.2715 2.9271 2.6187 2.2818 2.2245 2.1197 1.9470 1.4593 1.4764 1.5070 1.6062 1.0416 1.0641 1.0559 1.0515 1.0645 1.0632 1.0573 1.0609 8.0058 12.8308 12.3302 1.0821 1.0386 1.0370 1.0369 1.0374 1.1020 1.0905 1.1033 1.0936 1.1048 1.1028 1.1047 1.1042 1.1041 1.1044 1.0938
irintensity: 4.4316 2.4396 4.7336 5.1637 0.4982 0.5326 0.7923 0.3735 2.0416 1.1075 0.5505 0.6364 8.9953 1.7745 1.5988 3.5601 5.5666 2.5774 7.9932 2.1904 3.9050 2.5561 1.0895 3.7797 6.0184 6.0814 2.9658 7.6095 11.3660 11.0720 9.7207 16.3379 2.6164 3.0962 2.9433 18.9357 21.6742 22.6830 10.2455 11.9413 17.7219 27.2609 7.5698 1.9024 0.5469 12.0192 38.5138 17.5342 3.2902 14.7424 2.8834 7.5475 13.1106 38.0611 13.5213 22.5814 10.5591 2.3833 10.2796 5.2912 14.4249 14.5083 21.9980 9.0879 5.3994 4.3263 14.5187 12.4821 20.2334 439.6732 516.7215 16.7902 24.2915 29.7642 24.0101 23.5880 7.8179 17.7208 20.3359 6.7313 21.4304 21.4570 8.2831 16.9578 11.9876 13.7634 8.6517
temp: 298.150 k
press: 1.00000 atm
elementType: 6 6 6 6 6 6 6 6 1 6 8 8 1 6 6 6 6 1 1 1 1 1 1 1 1 1 1 1 1 1 1
symmnumber: 1
zpe: 685866.0 jmol-1
zpe.correction: 0.261233 hartree
zpe.thermalcorrener: 0.275378 hartree
zpe.thermalcorrenthalpy: 0.276322 hartree
zpe.thermalcorrgfe: 0.222101 hartree
zpe.sumelectzpe: -653.998898 hartree
zpe.sumelectthermal: -653.984753 hartree
zpe.sumelectthermalent: -653.983808 hartree
zpe.sumelectthermalfe: -654.038030 hartree
dipole: -1.7611 -1.2057 -0.4228
dipole: 2.1758
quadrupole: -97.8953 -90.2915 -87.4793
quadrupole: 8.8714 11.6161 -6.9575
quadrupole: -6.0066 1.5972 4.4094 8.8714 11.6161 -6.9575
hfenergy: -654.2601304 hartree
pointgroup: C01 [X(C13H16O2)]
dipole: 0.2059292 -0.8192138 0.1386849 debye
polarizability: 168.975456|-10.096416|186.0568318|-0.1356452|1.9967318|161.0355051 unknown
InChI: InChI=1S/C13H16O2/c1-6-5-12(3)7(2)11(15)13(4)8(6)9(14)10(12)13/h5,7-8,10H,1-4H3
charge 0 multiplicity 1
31 atoms
C  0.433383 1.27687393 -0.82687781
C  1.54318501 0.90083338 0.20122869
C  0.9760602 2.0138855 1.05384012
C  -0.39459906 1.80643528 0.40328897
C  1.0733341 -0.52478502 0.62921573
C  -0.01907465 -0.04382361 -1.43157104
C  0.7486502 -1.16049683 -0.74778578
C  -0.9963934 0.68849366 1.23634361
H  2.60521959 0.9285473 -0.08358097
C  -0.23551155 -0.40714403 1.38443551
O  1.43621798 2.83165932 1.7997683
O  -0.82770721 -0.16709818 -2.31737589
H  1.70934281 -1.22004888 -1.30134397
C  0.72698821 2.34749816 -1.85139933
C  0.05835201 -2.50541785 -0.78141445
C  -2.314487 0.9242601 1.88902087
C  2.13107015 -1.27057826 1.42178348
H  -1.06443586 2.66267354 0.25000678
H  -0.57069567 -1.25404337 1.99067652
H  -0.17844253 2.56460487 -2.43801801
H  1.51684476 2.02315913 -2.54640026
H  1.05809954 3.28179155 -1.3714355
H  -0.15178498 -2.79278671 -1.82219873
H  0.68289419 -3.29064673 -0.33031
H  -0.90295458 -2.47595016 -0.24652174
H  -2.61557081 0.07143729 2.51396414
H  -3.09764576 1.1000881 1.13227243
H  -2.28060645 1.82745506 2.52186101
H  3.05468878 -1.38497872 0.83337633
H  2.3776261 -0.73018558 2.34902468
H  1.7780529 -2.27491224 1.70302631
