program: Gaussian 16
title: Title Card Required
version: ES64L-G16RevC.01
frameworkgroup: C1[X(C13H16O2)]
method: RPBE1PBE
basis: def2SVP
operation: Freq
keyword: #P
keyword: Geom=AllCheck
keyword: Guess=TCheck
keyword: SCRF=Check
keyword: GenChk
keyword: RPBE1PBE/def2SVP
keyword: Freq
converged: YES YES YES YES
title: Mulliken charges:
elementType: C C C C C C C C C O O H C C C C H H H H H H H H H H H H H H H
charge: -0.525885 0.280377 0.280385 -0.277299 -0.277317 -0.038310 0.019263 -0.260605 0.183129 -0.223670 -0.223670 0.067534 0.057646 -0.006614 0.066027 0.066014 0.025563 0.064877 0.064877 0.054956 0.054956 0.048088 0.049551 0.060457 0.060457 0.055978 0.060947 0.047677 0.055981 0.060948 0.047683
chargesum: -0.00000
title: Mulliken charges with hydrogens summed into heavy atoms:
elementType: C C C C C C C C C O O C C C C
charge: -0.525885 0.280377 0.280385 -0.277299 -0.277317 0.029224 0.044827 -0.260605 0.312883 -0.223670 -0.223670 0.215646 0.163850 0.230629 0.230625
polarizability: 1.92869092e+02 1.42592885e+01 1.73031881e+02 -8.49700241e-05 -3.89679854e-04 1.58334149e+02
1716.lowfreq: -24.9891 -17.4860 -1.5299 -0.0005 0.0002 0.0006 78.9530 97.2061 106.8943
frequency: 78.8799 97.1878 106.5880 127.5889 158.6606 177.7552 191.5637 211.8904 225.8870 241.2697 245.2785 267.5686 286.4179 299.5910 320.1266 343.9143 415.5967 424.1202 463.6653 468.5104 524.5965 543.2871 602.8044 604.5510 729.1042 747.7863 782.4680 798.8117 837.1910 842.4656 867.4425 878.8084 903.5686 952.0814 987.5473 989.9031 1005.1920 1012.7255 1031.9799 1047.5099 1074.0740 1093.9771 1145.1254 1147.5139 1175.8532 1177.8912 1189.8691 1241.0273 1275.4197 1310.7664 1325.5844 1358.7926 1359.5004 1372.2945 1385.3189 1389.1865 1409.5990 1416.6852 1419.0893 1432.0969 1433.6093 1442.9836 1444.9143 1447.5691 1449.9804 1452.1151 1455.6945 1495.8747 1760.9330 1845.4202 1890.4715 3039.4859 3042.9970 3061.1560 3064.7692 3066.3930 3089.1532 3117.0610 3156.8658 3157.7526 3163.9145 3164.8975 3166.0483 3172.5294 3174.1060 3177.3223 3186.0060
redmass: 4.6290 8.8744 2.9532 1.0293 1.2820 1.1439 2.3601 1.0995 1.8688 2.2109 2.5011 2.6146 3.1543 3.1297 5.4683 4.4505 5.1675 2.5893 4.1313 2.9722 3.4300 4.8889 3.6959 7.0364 4.2352 2.6531 3.7377 3.6029 4.1632 1.7204 2.9932 1.8990 2.3867 1.7201 1.7353 1.3812 1.5379 2.3627 2.0277 1.4746 1.7302 1.6368 1.9065 2.1848 1.7461 2.5454 3.6998 4.5346 1.5966 1.7937 1.6504 1.4630 2.3124 1.2611 1.3883 1.2931 1.1762 1.9662 2.2263 1.0414 1.0418 1.0757 1.0893 1.0789 1.2426 1.1473 1.0925 4.0722 8.0076 12.9481 12.6680 1.0483 1.0529 1.0374 1.0375 1.0363 1.1028 1.1017 1.1044 1.1043 1.1037 1.1047 1.1051 1.0970 1.0955 1.1055 1.0913
irintensity: 0.0485 14.1116 0.7379 0.0537 0.4065 0.4709 0.0002 0.3811 0.1156 0.1932 1.4977 7.5159 2.8276 0.2477 2.0840 14.8442 5.9140 9.0559 3.9927 9.6961 0.0550 6.9626 0.8050 1.2922 1.7097 1.9234 7.9980 0.1305 2.9146 5.6246 0.3298 54.4731 6.1441 25.4182 12.8342 0.9721 15.0012 1.7986 42.0920 4.7199 21.9694 10.1091 1.6946 11.0602 3.5098 6.9111 2.0147 1.6205 0.0406 34.9038 7.1914 0.0866 89.5986 12.3945 8.8119 2.4281 29.1742 5.3832 3.5263 7.6299 14.7008 7.3200 1.4483 19.6713 20.5528 77.0726 2.5288 3.4321 10.4900 650.6322 135.7831 5.8335 65.2698 14.9845 36.5251 20.4770 6.5600 14.8209 1.0078 19.2643 15.9842 15.6545 11.4588 9.6808 8.1955 6.4865 14.1351
temp: 298.150 k
press: 1.00000 atm
elementType: 6 6 6 6 6 6 6 6 6 8 8 1 6 6 6 6 1 1 1 1 1 1 1 1 1 1 1 1 1 1 1
symmnumber: 1
zpe: 685828.5 jmol-1
zpe.correction: 0.261218 hartree
zpe.thermalcorrener: 0.275948 hartree
zpe.thermalcorrenthalpy: 0.276893 hartree
zpe.thermalcorrgfe: 0.221197 hartree
zpe.sumelectzpe: -654.015859 hartree
zpe.sumelectthermal: -654.001129 hartree
zpe.sumelectthermalent: -654.000184 hartree
zpe.sumelectthermalfe: -654.055880 hartree
dipole: -0.0846 -2.8105 -0.0001
dipole: 2.8118
quadrupole: -77.3395 -85.4140 -105.1428
quadrupole: 3.3968 -0.0003 0.0003
quadrupole: 11.9593 3.8848 -15.8440 3.3968 -0.0003 0.0003
hfenergy: -654.2770769 hartree
pointgroup: C01 [X(C13H16O2)]
dipole: 0.8543077 0.5042635 0.4895461 debye
polarizability: 191.8189896|-15.2460252|172.299679|3.6616529|1.4482857|160.1164533 unknown
InChI: InChI=1S/C13H16O2/c1-7-5-8-12(3)9(14)11(2,6-7)10(15)13(8,12)4/h5,8H,6H2,1-4H3
charge 0 multiplicity 1
31 atoms
C  -1.23463048 -0.63936861 -0.36261601
C  -0.69268486 -1.48071925 0.79182993
C  -0.03870658 -0.54891484 -1.30913765
C  0.79907606 -1.48767865 0.76486131
C  1.21808748 -0.89065224 -0.58125782
C  1.37989519 -0.08779557 0.6958592
C  0.69068178 1.18028552 1.04373767
C  -0.57700809 1.57354498 0.82353773
C  -1.63067487 0.75783993 0.13377865
O  -1.37199025 -2.09741703 1.57717169
O  -0.10667727 -0.29462475 -2.48780231
H  2.42512375 -0.08932944 1.02051515
C  -2.41986567 -1.31896345 -1.0329506
C  -1.04896925 2.92241071 1.27485047
C  1.52158232 -2.59894444 1.46351195
C  2.40579973 -1.33908917 -1.37704813
H  1.33953839 1.89383959 1.5621844
H  -2.49339588 0.64518191 0.81497384
H  -2.01227919 1.33068272 -0.73064901
H  -2.75804208 -0.72274961 -1.89235378
H  -3.24822215 -1.42118968 -0.31756006
H  -2.1537627 -2.32324895 -1.39553385
H  -0.25154659 3.49022706 1.77490955
H  -1.89798253 2.82821002 1.97360209
H  -1.41438145 3.51720601 0.42007335
H  1.23231515 -3.57843331 1.05230441
H  1.27399164 -2.59816584 2.53562601
H  2.61064969 -2.48935814 1.36421406
H  2.17124165 -2.24124784 -1.96293242
H  2.71071778 -0.55074146 -2.08150746
H  3.26071927 -1.56279619 -0.72359235
