program: Gaussian 09
title: 000041260
version: EM64L-G09RevD.01
frameworkgroup: C1[X(C20H38)]
method: RPBEPBE
basis: SDD
operation: Freq
keyword: #p
keyword: freq=noraman
keyword: PBEPBE/SDD
title: #p freq=noraman PBEPBE/SDD
converged: YES YES NO NO
title: Mulliken charges:
elementType: C C C C C C C C C C C C C C C C C C C C H H H H H H H H H H H H H H H H H H H H H H H H H H H H H H H H H H H H H H
charge: -0.108408 -0.089807 -0.049654 -0.050789 -0.037635 -0.477536 -0.466502 -0.454314 -0.444079 -0.425159 -0.482628 -0.781100 -0.776096 -0.401214 -0.384963 -0.385105 -0.373249 -0.354083 -0.356696 -0.696959 0.181539 0.212881 0.202318 0.206589 0.196346 0.191955 0.209708 0.203174 0.189891 0.191742 0.191625 0.190085 0.191512 0.191515 0.205845 0.203229 0.210893 0.210808 0.211489 0.221283 0.210799 0.208826 0.223381 0.189474 0.202898 0.191312 0.192059 0.191980 0.192688 0.189249 0.189845 0.187562 0.187964 0.194705 0.194743 0.209606 0.214802 0.209657
chargesum: 0.00000
title: Mulliken charges with hydrogens summed into heavy atoms:
elementType: C C C C C C C C C C C C C C C C C C C C
charge: 0.073130 0.123074 0.152665 0.155800 0.158711 -0.075873 -0.073437 -0.070947 -0.062482 -0.027799 -0.068506 -0.137521 -0.133090 -0.008841 -0.001592 -0.000438 0.005846 0.021443 0.032752 -0.062895
polarizability: 2.50641843e+02 8.34271980e-01 1.99728730e+02 9.77190822e+00 -3.79056184e-01 1.84355475e+02
1716.lowfreq: -23.4587 -9.9182 -3.7082 -0.0010 -0.0009 0.0006 4.6746 15.6684 28.1431
frequency: -19.2943 13.3265 27.9202 40.6217 58.1938 69.9881 90.1169 91.1664 99.3310 126.0850 133.3568 143.2220 151.3966 179.2586 200.3604 214.5659 229.4017 238.0732 252.8964 269.0885 280.8662 293.7487 333.5959 339.9340 352.8265 377.0036 393.8313 424.0848 431.3686 450.6286 462.7730 481.6786 486.5474 541.6822 565.3048 622.7221 717.1478 722.0728 738.5062 772.2247 784.4670 808.7498 815.1551 832.2598 837.9228 865.8744 875.2018 886.0235 896.6096 921.2590 924.7125 941.5390 951.4340 963.5648 987.9111 994.4721 1004.6474 1017.2274 1024.6137 1029.7908 1037.0513 1051.2744 1058.4299 1062.6724 1070.0049 1077.2158 1077.4306 1079.5845 1081.1413 1092.8911 1114.7365 1131.3472 1143.0245 1147.1324 1162.7288 1171.0704 1185.2374 1194.4392 1207.4601 1210.6210 1225.0836 1228.7845 1240.5106 1251.7355 1256.2180 1262.6182 1275.5815 1278.3447 1279.0742 1283.2459 1287.8623 1290.5059 1294.4200 1299.0145 1302.3790 1307.7935 1318.8746 1323.7866 1326.5966 1330.7469 1337.0476 1339.1780 1343.7668 1348.4671 1350.8184 1351.7193 1352.0070 1356.9506 1364.6085 1386.3046 1386.9622 1387.7233 1456.2470 1458.0060 1458.5370 1459.4190 1460.8783 1463.3257 1467.9822 1468.4527 1471.6986 1475.0948 1476.2659 1476.4861 1477.1882 1481.5133 1484.1685 1484.7992 1486.6275 1488.1825 2895.6987 2921.5383 2935.2394 2945.3807 2946.4834 2947.8446 2949.8214 2949.9841 2952.7983 2954.0233 2955.9612 2956.1023 2959.3015 2966.1282 2967.1497 2967.6244 2968.0627 2970.7284 2972.4301 2973.2703 2981.2666 2986.9464 2995.9302 3006.2414 3012.2463 3019.1722 3021.1837 3023.2895 3026.2672 3031.5097 3035.5449 3041.8974 3055.7053 3056.2806 3067.2877 3068.2248 3069.8558 3075.7369
redmass: 1.6285 3.2648 3.6991 3.0052 2.5199 2.0200 2.4565 2.6779 3.3080 1.8316 2.3017 2.5187 2.7648 1.3103 2.9923 1.5295 1.1128 1.9767 1.6519 2.3031 2.3007 1.9496 2.8770 2.4983 2.9490 3.7726 2.7605 2.3151 2.9313 2.8207 3.0847 2.4884 2.1790 2.3286 2.3533 2.6284 1.0651 1.0875 1.1654 1.5959 1.6511 2.0667 2.0146 1.5970 1.7037 1.4509 1.8847 1.9473 2.0665 1.2724 1.4408 1.4501 2.0927 1.4436 4.5248 1.7424 1.5850 1.5207 2.5265 2.0958 2.4062 1.7487 2.0828 1.8851 1.7861 2.0180 2.0133 2.1820 1.8974 2.0843 2.1688 2.0789 1.9914 1.8759 2.4898 1.7930 1.7844 1.7392 1.3394 1.5692 1.4206 1.3358 1.3527 1.3504 1.2990 1.2855 1.3216 1.0763 1.1730 1.2452 1.2194 1.0925 1.1536 1.3004 1.3644 1.2306 1.3843 1.3877 1.3989 1.4660 1.4779 1.5187 1.4353 1.4954 1.6451 1.5426 1.6312 1.5072 1.4520 1.2171 1.2099 1.2095 1.0757 1.0819 1.0742 1.0857 1.0719 1.0755 1.0817 1.0831 1.0829 1.0785 1.0468 1.0627 1.0679 1.0795 1.0478 1.0490 1.0814 1.0912 1.0799 1.0795 1.0798 1.0750 1.0591 1.0588 1.0596 1.0661 1.0600 1.0712 1.0675 1.0652 1.0595 1.0399 1.0582 1.0488 1.0496 1.0365 1.0637 1.0715 1.0959 1.0974 1.0996 1.1022 1.0966 1.1037 1.1026 1.0961 1.0959 1.1026 1.1016 1.1036 1.0983 1.0987 1.1007 1.0985 1.0992 1.0976
irintensity: 0.0029 0.0011 0.0030 0.0020 0.0107 0.0054 0.0157 0.0080 0.0178 0.0036 0.0036 0.0020 0.0033 0.0686 0.0557 0.0193 0.0006 0.0638 0.0922 0.0418 0.0589 0.0120 0.3863 0.6275 0.0485 0.1591 0.0444 0.1570 0.2019 0.2688 0.0043 0.2434 0.1380 0.2304 0.0956 3.9849 13.4736 1.2189 2.7458 0.1779 1.7290 7.1769 1.8960 3.7466 0.1766 1.9192 3.5404 4.6602 4.5395 5.0842 1.0856 3.0083 3.2354 1.5198 0.6342 1.0509 0.6133 6.8834 2.5509 8.7518 1.3057 2.2928 3.6703 0.7006 1.2202 0.6079 1.4975 0.8049 0.4273 1.0967 11.6448 1.8597 2.2756 1.8736 0.2189 0.1915 0.2802 0.6103 9.4687 7.8589 0.4383 0.8391 0.4214 0.4838 0.2235 0.3639 1.0381 0.4161 0.9329 2.9251 0.9604 0.3832 0.0107 1.1431 0.3861 0.5725 0.3224 1.2607 3.7905 0.9589 0.6324 1.0282 0.1377 0.5170 0.8081 2.7249 1.1950 1.6048 4.2484 11.2006 6.7897 25.5698 0.3769 6.0495 1.1257 6.3050 1.8388 0.8153 2.5765 2.3011 16.6021 6.2276 11.3972 7.7109 1.3809 5.7106 18.2574 7.2650 4.9108 26.0055 13.5428 0.6783 5.6735 0.7218 0.3153 0.6778 1.5527 39.3733 1.8378 13.1427 49.3775 66.0332 42.4161 36.4492 60.0293 29.1168 94.7017 36.9789 14.7354 159.4497 1.5243 2.1735 2.1772 1.1000 65.2342 12.7794 61.5509 55.5694 76.7311 20.9462 49.8142 223.7747 54.7234 65.0964 99.9587 51.1320 54.5819 43.4710
temp: 298.150 k
press: 1.00000 atm
elementType: 6 6 6 6 6 6 6 6 6 6 6 6 6 6 6 6 6 6 6 6 1 1 1 1 1 1 1 1 1 1 1 1 1 1 1 1 1 1 1 1 1 1 1 1 1 1 1 1 1 1 1 1 1 1 1 1 1 1
symmnumber: 1
zpe: 1406985.5 jmol-1
zpe.correction: 0.535892 hartree
zpe.thermalcorrener: 0.558613 hartree
zpe.thermalcorrenthalpy: 0.559557 hartree
zpe.thermalcorrgfe: 0.482660 hartree
zpe.sumelectzpe: -783.289181 hartree
zpe.sumelectthermal: -783.266461 hartree
zpe.sumelectthermalent: -783.265517 hartree
zpe.sumelectthermalfe: -783.342414 hartree
dipole: 0.0483 0.0441 0.0143
dipole: 0.0669
quadrupole: -131.6681 -129.6782 -130.3388
quadrupole: 0.0407 -1.1484 0.0335
quadrupole: -1.1064 0.8835 0.2229 0.0407 -1.1484 0.0335
hfenergy: -783.8250737 hartree
pointgroup: C01 [X(C20H38)]
dipole: 0.0192629 -0.0167307 -0.006532 debye
polarizability: 250.676674|0.4234201|199.7262955|-9.6839|0.3164551|184.3230788 unknown
InChI: InChI=1S/C20H38/c1-4-5-6-7-8-9-11-18-12-10-13-19-16(2)14-15-17(3)20(18)19/h16-20H,4-15H2,1-3H3
charge 0 multiplicity 1
58 atoms
C  2.595184 -0.290383 0.670843
C  3.100644 0.753754 -0.379825
C  1.189079 0.093913 1.249674
C  2.666645 -1.751095 0.128376
C  4.522671 0.393541 -0.913153
C  3.082231 2.184675 0.225411
C  1.26145 1.515736 1.870689
C  4.099855 -2.070376 -0.364039
C  4.570046 -1.064518 -1.431553
C  1.721052 2.572574 0.843808
C  0.031271 -0.057577 0.221654
C  2.211965 -2.79922 1.170004
C  5.013972 1.364063 -2.01295
C  -1.382142 0.131408 0.820979
C  -2.510004 -0.155613 -0.196406
C  -3.927695 0.023963 0.391938
C  -5.053873 -0.230407 -0.635435
C  -6.472647 -0.06236 -0.046199
C  -7.597321 -0.300259 -1.080006
C  -9.01142 -0.134594 -0.482246
H  3.304839 -0.239584 1.532181
H  2.408635 0.732152 -1.252168
H  0.972023 -0.611989 2.078959
H  1.999565 -1.827566 -0.75796
H  5.223663 0.463311 -0.050196
H  3.864583 2.238496 1.013828
H  3.358761 2.926433 -0.547302
H  0.286069 1.799238 2.3096
H  1.989423 1.496411 2.708875
H  4.796203 -2.047116 0.501424
H  4.129809 -3.101868 -0.769105
H  5.601338 -1.305659 -1.758906
H  3.923034 -1.150181 -2.33084
H  1.798887 3.565675 1.328725
H  0.963904 2.676325 0.040689
H  0.077657 -1.070753 -0.225863
H  0.164227 0.652387 -0.618698
H  2.390011 -3.824005 0.792324
H  2.77982 -2.685864 2.11435
H  1.137171 -2.71717 1.411422
H  5.977776 1.017811 -2.432084
H  4.285655 1.414366 -2.846303
H  5.167405 2.389752 -1.634525
H  -1.499774 -0.539466 1.698582
H  -1.501658 1.165418 1.202149
H  -2.401659 -1.19101 -0.582786
H  -2.390012 0.515546 -1.072931
H  -4.028312 1.052684 0.79755
H  -4.055761 -0.66288 1.254757
H  -4.929248 0.463797 -1.492994
H  -4.948223 -1.25547 -1.048951
H  -6.576296 0.958842 0.377257
H  -6.60335 -0.764856 0.803585
H  -7.490695 -1.319326 -1.505063
H  -7.467257 0.404292 -1.926856
H  -9.1530 0.885532 -0.077529
H  -9.796836 -0.309421 -1.240597
H  -9.176838 -0.848706 0.346636
