program: Gaussian 09
title: 000041228
version: EM64L-G09RevD.01
frameworkgroup: C1[X(C10H11NO3)]
method: RPBEPBE
basis: SDD
operation: Freq
keyword: #p
keyword: freq=noraman
keyword: PBEPBE/SDD
title: #p freq=noraman PBEPBE/SDD
converged: YES YES NO NO
title: Mulliken charges:
elementType: O O O N C C C C C C C C C C H H H H H H H H H H H
charge: -0.239560 -0.461810 -0.186566 -0.466202 -0.219059 0.548841 -0.403574 -0.480658 0.194671 0.278404 -0.442074 -0.326927 -0.686438 0.158542 0.201138 0.231159 0.190457 0.290809 0.235735 0.239037 0.204502 0.223135 0.238131 0.340831 0.337476
chargesum: 0.00000
title: Mulliken charges with hydrogens summed into heavy atoms:
elementType: O O O N C C C C C C C C C C
charge: -0.239560 -0.124334 -0.186566 -0.125371 -0.017921 0.548841 0.018042 -0.189849 0.194671 0.278404 -0.206339 -0.087891 -0.020670 0.158542
polarizability: 1.86494964e+02 2.02288046e+00 1.15088880e+02 -9.00108599e+00 -1.00941753e+01 7.41875875e+01
1716.lowfreq: -6.8848 -3.2953 -0.0003 -0.0003 0.0005 6.0794 35.6435 66.4875 105.1024
frequency: 35.3482 66.4787 105.1013 141.9199 154.9899 202.6476 226.7761 253.2705 284.8800 297.9590 326.0542 371.8902 409.4854 438.7173 460.0843 513.5398 557.6909 581.5998 587.4717 636.6136 678.8396 682.0717 724.6252 737.2385 804.3466 812.6032 817.9607 854.4343 874.2301 904.0042 933.4665 936.8835 982.5063 1041.7825 1059.6660 1072.7273 1100.6783 1124.9693 1144.9774 1194.8104 1230.9181 1245.5340 1254.2363 1260.3923 1286.0363 1325.6369 1334.6019 1387.2600 1394.8209 1432.0449 1444.4170 1461.5954 1474.9459 1485.8884 1491.8978 1625.4968 1637.2858 1755.6058 2941.2737 2962.2091 2981.5464 3034.7061 3075.4940 3088.4006 3134.0256 3163.5126 3189.1655 3560.1209 3620.8855
redmass: 4.2997 4.6292 2.4782 2.9709 6.7264 3.5749 1.2999 3.7613 2.7507 1.6601 3.9572 4.4106 4.1674 3.7919 3.5593 7.0187 5.1091 1.1470 4.9313 3.8104 8.3330 10.8307 3.0492 4.3334 1.7151 3.6466 1.8098 3.0330 1.9348 1.4939 3.3539 1.3658 6.5099 1.9186 3.6250 2.0039 1.8884 1.9504 1.4260 1.8849 1.8248 1.3176 1.3589 2.0053 1.1698 1.6048 2.1064 1.4810 1.3310 2.5881 4.2374 1.1748 1.0434 1.0560 3.6051 7.1404 8.3938 11.0414 1.0845 1.0633 1.0371 1.0971 1.0989 1.1002 1.0887 1.0964 1.0932 1.0658 1.0808
irintensity: 1.2561 1.3035 0.5276 2.5982 1.3028 3.2917 1.4035 5.2505 52.6426 78.3771 13.2407 4.3067 9.0224 6.8360 2.5630 6.1880 12.1241 118.4268 3.5579 14.0630 5.6832 19.9148 6.5256 1.3213 114.0370 77.8703 25.4655 7.9996 15.2063 24.0421 23.0794 0.7560 51.8056 1.5462 12.6739 7.9679 13.3184 58.1528 35.0020 27.2814 13.9719 8.9592 4.3163 26.0000 1.4301 20.9499 96.4758 11.0236 29.5208 2.2038 56.1552 20.9750 6.8254 11.1458 62.3912 16.6134 7.9493 857.6298 44.2757 54.9042 26.9150 18.8114 47.2753 47.2904 10.7649 9.7109 1.3142 4.9883 76.9435
temp: 298.150 k
press: 1.00000 atm
elementType: 8 8 8 7 6 6 6 6 6 6 6 6 6 6 1 1 1 1 1 1 1 1 1 1 1
symmnumber: 1
zpe: 510896.9 jmol-1
zpe.correction: 0.194590 hartree
zpe.thermalcorrener: 0.207257 hartree
zpe.thermalcorrenthalpy: 0.208201 hartree
zpe.thermalcorrgfe: 0.155252 hartree
zpe.sumelectzpe: -667.070422 hartree
zpe.sumelectthermal: -667.057755 hartree
zpe.sumelectthermalent: -667.056811 hartree
zpe.sumelectthermalfe: -667.109761 hartree
dipole: 5.0544 4.3606 -0.4236
dipole: 6.6889
quadrupole: -84.2990 -77.5363 -85.2353
quadrupole: -15.1852 6.2025 -3.0187
quadrupole: -1.9421 4.8206 -2.8785 -15.1852 6.2025 -3.0187
hfenergy: -667.2650125 hartree
pointgroup: C01 [X(C10H11N1O3)]
dipole: 1.9525191 1.3994243 1.0745432 debye
dipolederiv: -1.4793649 -0.1705533 0.0133284 0.060311 -0.3567788 -0.0898197 0.1488394 -0.0703207 -0.215682 -0.297953 -0.0091742 0.1289324 0.0295922 -0.5299904 -0.0469398 0.2202139 -0.0807378 -0.8521104 -1.6939382 -0.3874202 -0.0802363 -0.4249533 -0.5348096 -0.0536283 -0.0608503 -0.044313 -0.3659935 -1.1304145 -0.1823548 -0.0390748 -0.4948505 -0.617606 -0.0950258 -0.1490408 -0.1112202 -0.3705905 0.5256439 -0.0282321 -0.0937672 -0.0682109 0.4210345 0.0571869 -0.2772026 0.1138972 0.6239004 0.0555257 -0.0287478 0.0395076 -0.1854548 -0.0535453 -0.0009435 -0.0503902 0.0030056 -0.118382 0.051788 0.0266375 -0.0784749 0.0472436 0.0285362 0.031789 0.1055825 -0.0290438 -0.0483888 -0.0762973 -0.0147284 -0.0366146 0.0054756 -0.017691 0.047772 -0.0781456 0.0847639 -0.0745213 0.5816682 0.214713 0.0617775 0.7128793 0.256732 0.0446443 0.2754924 0.0732153 0.0762779 0.942482 0.0825112 -0.0234518 -0.2216124 -0.1262025 -0.0646786 -0.1745176 -0.0887823 0.031697 -0.1324556 -0.0219928 -0.0256559 0.1246531 0.0102033 0.0718548 0.0814136 0.0788719 -0.1309967 -0.0321117 0.0509081 0.0047514 -0.0490791 0.0539493 0.0922048 -0.0437476 0.0858749 -0.1264574 0.0609567 0.0267818 -0.0123472 0.0549805 0.0627446 -0.0011837 -0.0105472 -0.0425127 -0.0677792 2.5772727 0.5325917 0.0686746 0.5068669 1.0546849 0.2951289 0.011494 0.2736813 0.4433452 -0.0695283 -0.0748109 0.009716 -0.0935187 -0.1681205 -0.0160469 -0.008921 -0.031948 -0.0197803 0.0316314 -0.1183168 -0.0059362 -0.0835886 -0.0804198 0.0114787 -0.0197675 -0.0177348 0.0363248 -0.2282173 0.0964398 0.0787057 0.1026588 0.0479991 -0.0137993 0.0478934 -0.0254477 -0.0149867 0.1565715 0.0118277 0.0111272 0.0192122 0.0477444 -0.0437256 0.004568 -0.0498948 0.1463383 -0.0285732 -0.1111252 -0.0242505 -0.0979678 0.0341026 -0.04982 -0.0179629 -0.0458955 0.1266877 0.0568679 0.0561874 0.0320096 0.0479695 -0.0236164 -0.0863949 0.0348066 -0.089828 0.1380601 0.0319639 -0.1020381 0.0088688 -0.1357624 -0.10964 -0.0289594 0.0411486 0.0323775 0.0679489 0.0245022 0.0582808 -0.1040975 0.0909729 0.0130233 0.1107629 -0.107657 0.0821378 -0.0763339 -0.0948159 0.0417549 0.0921421 0.0241442 0.0563669 -0.0537972 0.1070181 -0.031184 0.0762712 0.203453 -0.0542624 -0.0073004 -0.0547112 0.2301741 -0.0608066 -0.0077175 -0.0577139 0.3466506 -0.0366574 0.1051232 -0.0183336 0.0827499 0.3011252 -0.0572533 -0.0720025 -0.0112483 0.3685005 unknown
polarizability: 186.9470092|5.2886635|108.1175134|0.2852643|18.6459016|80.7069093 unknown
InChI: InChI=1S/C10H11NO3/c1-2-8(12)6-3-4-7-9(5-6)14-10(13)11-7/h3-5,8,11-12H,2H2,1H3
charge 0 multiplicity 1
25 atoms
O  -2.139372 -1.199681 -0.629393
O  2.869396 -0.756682 -1.808211
O  -4.467103 -0.864194 -0.265611
N  -2.807665 0.768234 0.303845
C  2.778723 -0.028918 -0.52479
C  1.304361 0.275475 -0.303744
C  3.401422 -0.881914 0.615432
C  0.333701 -0.706692 -0.642961
C  -0.998313 -0.396286 -0.376495
C  -1.402361 0.833315 0.204689
C  0.904783 1.510735 0.268685
C  -0.454588 1.8131 0.536776
C  3.441153 -0.16507 1.980931
C  -3.303892 -0.447609 -0.188922
H  3.341397 0.928237 -0.593339
H  2.831025 -1.827386 0.693271
H  4.437475 -1.151433 0.317773
H  0.631631 -1.641217 -1.123217
H  1.668351 2.260989 0.503715
H  -0.742348 2.774009 0.973658
H  4.023229 0.774613 1.924801
H  3.913715 -0.806975 2.745456
H  2.424131 0.086632 2.329251
H  -3.427853 1.485137 0.673046
H  3.7918 -1.103019 -1.913346
