program: Gaussian 09
title: 000005380
version: EM64L-G09RevD.01
frameworkgroup: C1[X(C13H15N5O3)]
method: RPBEPBE
basis: SDD
operation: Freq
keyword: #p
keyword: freq=noraman
keyword: PBEPBE/SDD
title: #p freq=noraman PBEPBE/SDD
converged: NO YES NO NO
title: Mulliken charges:
elementType: O O O N N N N N C C C C C C C C C C C C C H H H H H H H H H H H H H H H
charge: -0.315407 -0.181233 -0.204143 -0.452639 -0.034841 -0.136801 -0.361848 -0.005006 -0.373529 -0.344236 -0.251725 -0.684266 0.537453 0.434559 -0.601740 -0.352165 -0.392462 -0.206366 0.164148 0.070014 -0.054935 0.210786 0.210856 0.200021 0.199664 0.234488 0.234635 0.213236 0.213450 0.221931 0.271327 0.311579 0.264770 0.366326 0.234139 0.359959
chargesum: 0.00000
title: Mulliken charges with hydrogens summed into heavy atoms:
elementType: O O O N N N N N C C C C C C C C C C C C C
charge: -0.315407 -0.181233 -0.204143 -0.086313 -0.034841 -0.136801 -0.001889 -0.005006 0.048112 0.055450 0.217399 -0.035648 0.537453 0.434559 -0.330413 -0.040586 -0.127692 0.027773 0.164148 0.070014 -0.054935
polarizability: 2.75615780e+02 -2.75006844e+01 2.34363454e+02 -1.70053749e-01 -1.72315258e-01 9.10674767e+01
1716.lowfreq: -4.0197 -0.0003 0.0006 0.0007 1.2821 4.1113 17.2421 28.9250 39.7684
frequency: 17.1425 28.9137 39.7476 47.9273 61.6333 71.1624 78.7063 82.4099 110.0164 122.3953 138.4543 163.2493 193.8870 232.0677 240.9677 255.4410 257.9651 297.3446 321.4887 352.6970 363.8290 410.0354 448.2761 468.6059 499.9067 506.6834 594.0693 599.4191 632.3771 674.7805 702.1406 720.7430 742.4573 743.4346 758.0715 763.7995 771.1609 797.3961 825.0726 853.6231 874.3793 905.4793 911.8132 916.7346 921.9466 933.6177 942.3251 950.1152 985.4213 999.1858 1004.9863 1039.3438 1072.4404 1074.0721 1088.0083 1105.4442 1112.5356 1124.1354 1147.5207 1154.8972 1174.9214 1185.1110 1203.0040 1213.7884 1262.9594 1273.0037 1273.2269 1290.0971 1316.8939 1344.8945 1370.1954 1389.6836 1396.0848 1396.4385 1410.0909 1459.7147 1469.5022 1473.2918 1480.5472 1480.8241 1490.8496 1497.6137 1540.9756 1595.9726 1623.4447 1628.6931 1660.4892 2972.0700 2978.2638 2990.6100 3007.5261 3015.3576 3047.1228 3073.9771 3079.1167 3083.2867 3136.1561 3145.1013 3169.0623 3194.4371 3476.6465 3606.2179
redmass: 4.3493 4.8726 4.3881 5.8803 4.1891 3.8542 6.2433 3.4589 2.1652 5.5262 5.3248 3.2447 5.6868 4.9356 1.1380 8.0728 4.2128 5.8684 5.6354 12.0921 8.9294 3.0213 3.3569 6.1787 6.0972 8.4154 5.0997 7.6945 7.6966 7.5365 2.0234 1.2167 1.0769 3.4207 2.8993 9.1053 2.1076 1.1469 1.4672 6.3427 6.1926 4.4027 2.5471 5.8758 1.6239 1.1653 1.3903 9.7697 6.3626 8.2638 1.3425 3.3886 3.3016 2.9283 3.2952 2.0252 4.5509 2.6000 1.4836 7.1162 3.5020 1.0926 3.2013 1.3383 2.1574 1.1560 1.3280 1.0798 1.4309 1.4248 1.5346 5.3355 1.8024 1.2349 2.5224 3.0401 1.0898 1.0670 1.0449 1.0652 1.1033 2.8784 2.8466 5.7276 6.9730 7.2750 10.4036 1.0589 1.0365 1.0596 1.0566 1.1005 1.1037 1.1022 1.0994 1.1075 1.0924 1.0881 1.0960 1.0958 1.0768 1.0846
irintensity: 0.3571 0.3993 4.8955 1.4245 0.6256 1.2051 0.9551 0.4337 0.1328 5.1442 0.9871 1.4529 5.3830 7.2638 0.0044 0.2485 5.1576 0.4872 2.0636 2.4392 2.9980 8.1587 7.1704 2.0520 1.5439 9.2264 1.6965 12.9632 11.0625 11.2032 13.2389 124.4827 9.9835 0.7138 46.1586 10.5132 52.4561 0.0219 36.7550 5.2725 13.0096 37.2927 10.1749 62.5785 44.9341 1.0380 0.0636 12.0727 1.9219 8.0417 3.4270 33.1600 29.2106 176.7626 161.7778 1.4968 13.4539 3.8529 2.4556 0.0906 69.7627 0.7948 2.8902 0.0316 2.5989 0.0793 3.8799 0.2039 16.0741 0.0341 13.7370 69.2125 64.3298 1.5863 44.1598 25.3837 3.4078 0.5339 13.0680 8.8363 4.7187 201.7350 252.6938 9.2232 90.4741 112.9419 265.9735 25.4117 27.3463 22.8368 30.8008 5.2767 6.6971 24.2616 48.1137 87.5663 2.8787 10.2116 5.9977 6.5223 72.5347 145.0784
temp: 298.150 k
press: 1.00000 atm
elementType: 8 8 8 7 7 7 7 7 6 6 6 6 6 6 6 6 6 6 6 6 6 1 1 1 1 1 1 1 1 1 1 1 1 1 1 1
symmnumber: 1
zpe: 724525.3 jmol-1
zpe.correction: 0.275957 hartree
zpe.thermalcorrener: 0.295877 hartree
zpe.thermalcorrenthalpy: 0.296821 hartree
zpe.thermalcorrgfe: 0.223753 hartree
zpe.sumelectzpe: -1002.248497 hartree
zpe.sumelectthermal: -1002.228577 hartree
zpe.sumelectthermalent: -1002.227633 hartree
zpe.sumelectthermalfe: -1002.300702 hartree
dipole: -1.8477 4.8498 0.0135
dipole: 5.1899
quadrupole: -89.8337 -140.4158 -123.0974
quadrupole: 13.6971 0.0376 -0.0686
quadrupole: 27.9486 -22.6335 -5.3151 13.6971 0.0376 -0.0686
hfenergy: -1002.5244541 hartree
pointgroup: C01 [X(C13H15N5O3)]
dipole: -0.7015322 1.9091349 0.1795697 debye
polarizability: 274.7085604|-27.4686577|234.063761|-8.0244556|12.1083882|92.274389 unknown
InChI: InChI=1S/C13H15N5O3/c1-2-3-7-21-13(20)12(19)14-10-6-4-5-9(8-10)11-15-17-18-16-11/h4-6,8,14,17H,2-3,7H2,1H3
charge 0 multiplicity 1
36 atoms
O  3.227157 -0.42741 0.010034
O  4.15696 -2.563917 -0.194249
O  1.430111 -3.544837 -0.182548
N  0.778325 -1.280802 0.026468
N  -4.851044 1.245635 0.396733
N  -2.843341 2.373963 0.420528
N  -4.997035 2.600148 0.504087
N  -3.805883 3.317993 0.521965
C  4.430805 1.691841 0.152699
C  5.79904 2.416859 0.165406
C  4.599828 0.180455 0.010872
C  5.647896 3.946794 0.304025
C  -0.638786 -1.363602 0.063922
C  -2.765835 -0.148345 0.225685
C  -1.352752 -0.144777 0.180728
C  -1.344106 -2.596366 -0.009359
C  -3.475116 -1.376765 0.154457
C  -2.755161 -2.582357 0.037836
C  3.163254 -1.823586 -0.100239
C  1.694413 -2.315683 -0.089264
C  -3.482891 1.125108 0.345385
H  3.815496 2.074368 -0.684456
H  3.882735 1.914525 1.088636
H  6.416106 2.028046 1.000502
H  6.350498 2.182688 -0.767699
H  5.095682 -0.104492 -0.935194
H  5.166227 -0.263813 0.849859
H  5.057596 4.365117 -0.532634
H  5.131978 4.212357 1.245602
H  6.632978 4.447352 0.305899
H  -0.824615 0.814468 0.237689
H  -0.788866 -3.531399 -0.102516
H  -4.56871 -1.372602 0.189881
H  1.196284 -0.345077 0.090086
H  -3.296866 -3.532421 -0.01825
H  -5.907962 3.053731 0.566627
