program: Gaussian 09
title: 000005370
version: EM64L-G09RevD.01
frameworkgroup: C1[X(C5H7NO4)]
method: RPBEPBE
basis: SDD
operation: Freq
keyword: #pfreq=noraman
keyword: PBEPBE/SDD
title: #p freq=noraman PBEPBE/SDD
converged: YES YES NO NO
title: Mulliken charges:
elementType: O O O O N C C C C C H H H H H H H
charge: -0.410035 -0.403255 -0.227221 -0.235574 -0.325438 -0.497010 -0.209209 -0.187137 0.210470 0.167626 0.268512 0.270305 0.272987 0.253047 0.288784 0.381371 0.381778
chargesum: 0.00000
title: Mulliken charges with hydrogens summed into heavy atoms:
elementType: O O O O N C C C C C
charge: -0.028664 -0.021477 -0.227221 -0.235574 -0.036655 0.029024 0.059303 0.083168 0.210470 0.167626
polarizability: 8.99124554e+01 -1.96725620e+00 7.20469561e+01 -1.86126680e+00 -2.05772965e+00 4.86005963e+01
1716.lowfreq: -8.0423 0.0004 0.0006 0.0008 4.2072 11.7221 37.2988 54.4777 63.7170
frequency: 37.1892 54.4315 63.5568 121.5628 188.6891 239.6084 315.9179 389.2425 437.0573 548.0106 572.0172 575.9275 590.7993 636.1909 681.0892 700.0437 772.2484 785.5170 884.8436 961.3282 973.5724 1005.3295 1027.1675 1058.8115 1059.5895 1107.1563 1132.7926 1192.7113 1233.6952 1251.5545 1252.6081 1262.8420 1319.1466 1349.3270 1395.1324 1469.4229 1646.9379 1668.6739 2997.0282 3044.9251 3065.7936 3143.6941 3441.2781 3510.2528 3511.3097
redmass: 12.1828 4.8983 5.6860 5.6402 7.1215 4.1471 3.1845 4.2795 4.9707 3.1972 2.3046 1.5981 1.7141 2.0903 2.6530 3.8759 2.4751 3.1811 3.8741 2.2868 2.3816 3.5597 3.5239 1.9625 2.1840 2.0198 1.4641 1.2958 1.3805 1.3901 1.4628 1.5819 1.6959 1.9067 1.6052 1.1014 8.7761 9.1982 1.0844 1.0848 1.0616 1.1089 1.0764 1.0642 1.0640
irintensity: 2.9576 0.5084 0.8588 2.0670 1.3437 1.8448 15.2227 5.1918 66.1783 39.9508 47.6168 47.6869 2.9449 261.9924 7.8462 77.6053 0.8221 16.4159 11.1311 6.2759 74.2991 86.7902 149.5302 126.6514 123.3966 8.5951 45.9073 5.8873 11.6515 5.8957 8.0534 31.8214 44.6409 22.8813 14.8044 7.9137 220.1550 189.8890 29.5986 23.0793 14.4441 6.5968 5.7928 24.7186 21.6232
temp: 298.150 k
press: 1.00000 atm
elementType: 8 8 8 8 7 6 6 6 6 6 1 1 1 1 1 1 1
symmnumber: 1
zpe: 327035.2 jmol-1
zpe.correction: 0.124561 hartree
zpe.thermalcorrener: 0.134332 hartree
zpe.thermalcorrenthalpy: 0.135276 hartree
zpe.thermalcorrgfe: 0.087820 hartree
zpe.sumelectzpe: -549.584221 hartree
zpe.sumelectthermal: -549.574450 hartree
zpe.sumelectthermalent: -549.573506 hartree
zpe.sumelectthermalfe: -549.620962 hartree
dipole: 1.2131 0.0843 -1.0187
dipole: 1.5863
quadrupole: -47.6328 -64.4907 -57.4209
quadrupole: -8.4590 -0.1571 2.1377
quadrupole: 8.8820 -7.9759 -0.9061 -8.4590 -0.1571 2.1377
hfenergy: -549.7087823 hartree
pointgroup: C01 [X(C5H7N1O4)]
dipole: 0.4765797 -0.0446922 0.4004501 debye
dipolederiv: -0.6132553 -0.5023638 0.0440238 -0.4349494 -0.9784967 -0.0339873 -0.0105009 -0.0699747 -0.3986891 -0.9640001 -0.5300679 0.0011595 -0.4953301 -0.685038 -0.0778184 -0.0803337 -0.1309148 -0.3793278 -0.7357085 0.257098 -0.0297847 -0.004846 -0.8789125 -0.0121783 -0.077227 0.057787 -0.3052005 -0.6682174 0.1399563 -0.0849293 -0.0357399 -0.9330265 0.0682178 -0.1141351 0.1671493 -0.3292122 -0.5361936 -0.0925484 -0.0453572 -0.1383419 -0.2475896 -0.0867802 -0.0644887 -0.0800786 -0.5155355 0.0392883 -0.0673601 0.0525656 -0.0181836 0.017997 0.0110103 -0.0521687 0.0435748 0.0789914 0.2073675 -0.0442774 -0.1009394 -0.0452023 0.0583746 0.0024051 -0.0800467 -0.0563184 0.3502647 0.0298135 0.2137927 -0.0346188 0.5348416 0.1575654 -0.0623202 0.0287459 -0.0827189 0.202339 1.2328366 0.1640015 0.0941604 0.2187633 1.4861958 0.0195414 0.1300775 -0.0029342 0.1911064 1.3680978 0.2006355 0.1956265 0.2202052 1.3241026 -0.1153333 0.3013112 -0.1519785 0.2007304 0.0127064 0.0101598 -0.0061631 -0.0033809 -0.001751 0.0991708 0.0499212 0.0731695 -0.1051764 -0.0096577 -0.0444228 0.0396867 -0.0854305 0.0141047 0.0772325 0.0614593 0.0824322 -0.0091649 0.0765435 0.0994998 -0.016712 0.0456583 0.0043642 0.019428 0.0090406 0.043195 0.0771295 0.0442384 -0.0319687 -0.0741171 -0.0214622 0.0781786 -0.0192885 -0.0573341 -0.0660237 -0.0641871 0.1534233 0.0771544 0.0997209 0.0092186 0.0768837 0.0071447 0.0978198 0.0889631 0.2796079 0.1346541 0.072835 -0.0565905 0.1237325 0.2828909 0.0302217 -0.0664534 0.0213301 0.3776133 0.2280631 0.0778761 -0.0777314 0.1304472 0.2241569 0.073334 -0.0756871 0.0633406 0.3487108 unknown
polarizability: 89.7425743|2.4278959|72.3624547|2.259658|-0.3375482|48.4549788 unknown
InChI: InChI=1S/C5H7NO4/c7-4(8)2-1-3(6-2)5(9)10/h2-3,6-7,9H,1H2
charge 0 multiplicity 1
17 atoms
O  -2.963036 -1.205262 0.125153
O  3.239133 0.905172 0.208541
O  -2.908183 1.117837 0.058471
O  2.474603 -1.286839 0.366034
N  -0.07017 -0.551348 -0.800722
C  0.037077 1.125587 0.560115
C  -0.826382 -0.168521 0.453791
C  0.983467 0.477239 -0.524203
C  -2.312132 0.029779 0.202919
C  2.270914 -0.090574 0.05641
H  -0.684909 -0.87026 1.299182
H  1.229549 1.12324 -1.383573
H  -0.492984 2.013015 0.183971
H  0.485946 1.3384 1.540171
H  0.245885 -1.530527 -0.865109
H  -3.921747 -1.064973 -0.104836
H  4.07097 0.511432 0.588885
