program: Gaussian 09
title: 000041250
version: EM64L-G09RevD.01
frameworkgroup: C1[X(C19H32N2)]
method: RPBEPBE
basis: SDD
operation: Freq
keyword: #pfreq=noraman
keyword: PBEPBE/SDD
title: #p freq=noraman PBEPBE/SDD
converged: YES YES NO NO
title: Mulliken charges:
elementType: N N C C C C C C C C C C C C C C C C C C C H H H H H H H H H H H H H H H H H H H H H H H H H H H H H H H H
charge: -0.132692 -0.205489 -0.341996 -0.399523 -0.414633 -0.393227 -0.046081 -0.031085 -0.362138 -0.388403 0.253184 -0.543451 0.380380 -0.697416 -0.693584 -0.703821 -0.690735 -0.345874 -0.437798 -0.261707 -0.259596 0.206194 0.191174 0.192885 0.197793 0.211201 0.235865 0.210715 0.198563 0.213803 0.194322 0.193467 0.194978 0.203452 0.205836 0.204042 0.203418 0.211561 0.205895 0.211410 0.198160 0.207294 0.229612 0.209699 0.202875 0.237597 0.229802 0.197957 0.203971 0.239879 0.228137 0.221243 0.222887
chargesum: 0.00000
title: Mulliken charges with hydrogens summed into heavy atoms:
elementType: N N C C C C C C C C C C C C C C C C C C C
charge: -0.132692 -0.205489 0.055372 -0.008845 0.032434 0.016051 0.167722 0.163236 0.026307 0.020885 0.253184 -0.135991 0.380380 -0.068551 -0.058519 -0.053650 -0.059004 -0.105995 -0.209661 -0.040464 -0.036709
polarizability: 2.14528157e+02 2.36629524e+01 2.29311996e+02 1.46165334e+01 -3.08247852e+00 2.06083248e+02
1716.lowfreq: -0.0007 -0.0006 -0.0002 6.3247 6.8195 9.8431 18.8275 21.2056 34.2134
frequency: 15.0938 20.9579 34.1899 55.5301 63.9171 78.6453 88.1918 109.8713 127.7975 143.2794 184.7689 198.0201 204.5158 213.9063 227.3599 234.0858 262.7223 270.7236 276.1455 282.7414 306.1643 313.9336 331.8949 340.4587 363.9788 371.0748 385.5895 438.1841 452.1459 467.1690 487.2989 506.6847 522.4194 536.0181 560.1915 570.3356 588.4470 673.7946 701.3247 739.9257 752.5717 761.0052 784.2739 813.4252 831.1510 833.7439 853.7846 862.3974 878.8139 884.7272 899.7458 901.7393 921.4403 927.1563 927.4925 937.0274 953.7024 971.6381 975.0527 1002.5099 1031.5076 1043.5600 1050.7163 1066.3232 1082.7785 1085.4604 1099.9912 1112.0158 1115.4066 1126.1500 1135.8626 1146.0603 1160.9529 1169.3851 1171.6410 1174.4563 1188.3178 1208.8251 1222.1609 1237.6102 1241.5714 1251.0015 1274.0608 1291.8868 1294.4665 1297.8384 1308.3531 1316.0232 1320.3753 1329.9736 1342.9475 1350.9650 1353.7232 1360.8679 1363.3243 1363.7971 1371.0005 1378.6829 1380.7876 1384.9044 1387.5932 1392.5394 1436.7187 1447.9300 1455.6082 1458.3580 1459.7296 1462.3393 1462.4696 1465.2523 1465.3850 1470.2722 1474.6120 1478.0623 1481.9175 1486.1103 1487.2204 1489.0153 1497.1656 1578.4989 1605.7671 2892.0422 2894.2020 2934.9382 2951.5609 2965.4957 2967.5265 2970.9366 2974.7778 2976.9858 2977.3801 2983.0652 2998.5857 3002.1290 3015.1527 3019.0865 3022.3078 3029.2935 3034.5941 3040.4748 3058.0309 3061.4667 3061.8630 3066.1557 3068.7463 3072.8830 3087.6055 3089.8872 3093.1865 3111.7340 3124.4017 3145.5177 3160.4557
redmass: 3.5601 4.1691 3.6311 3.3236 2.5587 2.9660 3.1154 2.6180 3.5957 2.8235 1.2826 1.8701 1.2379 1.7177 1.6448 1.5073 2.7237 1.8269 1.3527 2.6856 2.3183 2.9387 2.8950 2.7663 2.5025 2.4695 2.1547 2.2188 3.3558 2.4434 3.0012 3.2265 2.4427 2.4376 3.1286 2.7333 3.7487 3.8405 2.8380 2.2559 1.7250 1.6326 2.2449 1.7808 2.7856 2.3799 1.4075 1.9753 2.1817 1.6126 1.3230 1.2867 1.3302 1.5168 1.9729 1.4318 2.6560 1.3291 2.0673 1.8558 2.7761 2.1874 2.2017 1.8113 2.3097 2.4569 1.7921 2.3657 2.2301 2.2953 1.6605 2.1840 2.0082 1.8244 1.2893 1.2681 1.5788 2.6268 1.6150 1.7151 1.3422 1.2930 1.5649 1.4038 1.2399 1.2650 1.3620 1.5386 1.3457 1.4681 1.2509 1.3728 1.5430 1.3311 1.2509 1.2990 1.2662 4.4443 1.2220 1.2327 1.4008 1.2794 2.0466 1.1258 1.0636 1.1445 1.0740 1.1016 1.0691 1.1349 1.0829 1.0535 1.0563 1.0524 1.0697 1.0535 1.0577 1.3636 1.5621 6.7312 6.1097 1.0692 1.0704 1.0678 1.0644 1.0591 1.0345 1.0355 1.0622 1.0372 1.0359 1.0836 1.0623 1.0837 1.0895 1.0891 1.1014 1.0944 1.0944 1.1020 1.0991 1.0995 1.0998 1.0997 1.0982 1.0987 1.0996 1.0999 1.0983 1.0870 1.0876 1.0925 1.1000
irintensity: 0.0301 0.1377 0.0374 0.2315 0.0585 0.5863 1.1988 0.3171 2.3003 1.2718 0.4595 0.2693 0.0655 1.0104 2.1575 1.6128 0.5568 0.4652 0.0734 0.2122 0.4540 0.8643 0.1055 0.4434 2.7488 1.6277 0.1274 12.3432 2.5343 1.7606 11.3949 0.5430 13.0964 1.1100 2.9221 2.3683 0.1380 4.1033 3.3670 28.3238 3.9345 65.3583 0.9659 3.3860 0.1893 3.1021 0.8322 10.1621 3.2696 4.1392 1.1335 1.3879 1.1565 5.8120 12.6663 3.5993 4.3343 0.4124 3.7983 8.7312 10.9662 2.7349 25.5724 9.7295 3.0692 15.1402 2.0817 4.2959 3.2741 25.0787 14.4511 47.4306 16.0069 52.0050 10.5296 16.9143 3.3992 55.1802 3.4919 50.4839 24.8532 1.0316 30.5566 2.9057 6.9243 1.9212 6.2370 39.9832 25.9911 2.4615 20.2997 7.0321 3.1325 17.4659 2.1909 10.8747 30.7803 1.1407 27.0106 6.1006 2.4837 21.4684 14.1262 10.0201 2.2761 11.7768 4.0960 6.7244 2.6287 12.9890 1.0069 9.3235 7.8074 9.0114 10.7039 9.9608 14.5692 20.5712 56.6088 6.5807 35.3750 65.9965 81.9223 72.7734 25.8871 25.3309 24.9598 25.5042 54.9686 43.6443 17.3387 13.0638 30.1471 12.8638 19.1906 17.8810 40.4505 56.3011 37.9105 80.1017 1.5358 21.4055 43.6161 32.9633 79.0792 148.9269 18.8844 42.5967 36.2048 11.3592 10.8984 32.9595 25.9826
temp: 298.150 k
press: 1.00000 atm
elementType: 7 7 6 6 6 6 6 6 6 6 6 6 6 6 6 6 6 6 6 6 6 1 1 1 1 1 1 1 1 1 1 1 1 1 1 1 1 1 1 1 1 1 1 1 1 1 1 1 1 1 1 1 1
symmnumber: 1
zpe: 1240669.0 jmol-1
zpe.correction: 0.472546 hartree
zpe.thermalcorrener: 0.495402 hartree
zpe.thermalcorrenthalpy: 0.496346 hartree
zpe.thermalcorrgfe: 0.419648 hartree
zpe.sumelectzpe: -851.039225 hartree
zpe.sumelectthermal: -851.016369 hartree
zpe.sumelectthermalent: -851.015425 hartree
zpe.sumelectthermalfe: -851.092123 hartree
dipole: -0.0966 -1.5678 0.0659
dipole: 1.5721
quadrupole: -133.6198 -126.7627 -127.0119
quadrupole: -0.5111 0.4736 1.7986
quadrupole: -4.4883 2.3687 2.1196 -0.5111 0.4736 1.7986
hfenergy: -851.5117709 hartree
pointgroup: C01 [X(C19H32N2)]
dipole: 0.0184126 -0.6084694 0.1094791 debye
polarizability: 211.3041366|23.6911293|232.2505015|11.5497464|-6.1503842|206.3687629 unknown
InChI: InChI=1S/C19H32N2/c1-16(2)21(17(3)4)15-9-14-20-13-8-7-11-18-10-5-6-12-19(18)20/h5-6,10,12,16-17H,7-9,11,13-15H2,1-4H3
charge 0 multiplicity 1
53 atoms
N  -2.742038 0.00443 -0.059303
N  1.422357 -1.061317 -0.848543
C  -1.675001 -0.950612 -0.427019
C  0.405439 -1.324973 -1.897417
C  -0.894281 -0.513249 -1.691352
C  2.342257 -2.189151 -0.526774
C  -2.265567 1.197317 0.696037
C  -4.075869 -0.55988 0.282323
C  2.414828 -2.567011 0.968719
C  3.091331 -1.48986 1.838398
C  1.959657 0.25749 -0.73157
C  2.355051 -0.123988 1.796939
C  2.501479 0.697387 0.522569
C  -2.128397 0.991327 2.234461
C  -3.117492 2.450008 0.384215
C  -4.071787 -1.705216 1.341441
C  -4.810349 -1.022714 -1.000479
C  1.970344 1.154586 -1.838438
C  3.091593 1.983206 0.592495
C  2.54373 2.438746 -1.734656
C  3.12669 2.856705 -0.517898
H  -0.94195 -1.101312 0.400737
H  -2.129944 -1.940357 -0.621824
H  0.159358 -2.402645 -1.841709
H  0.802008 -1.151212 -2.925551
H  -1.54402 -0.634007 -2.580007
H  -0.656455 0.563758 -1.62391
H  3.368197 -1.956507 -0.887999
H  1.995863 -3.071108 -1.096844
H  -1.246819 1.397415 0.307257
H  -4.660651 0.277791 0.70982
H  2.974505 -3.520642 1.058337
H  1.386395 -2.753207 1.337877
H  4.143782 -1.35284 1.517879
H  3.11948 -1.842276 2.888643
H  2.704246 0.491733 2.647249
H  1.274358 -0.322047 1.966089
H  -1.532837 0.087665 2.463452
H  -3.119471 0.88718 2.714117
H  -1.62028 1.85901 2.695919
H  -4.149239 2.353423 0.771722
H  -2.671182 3.346564 0.853408
H  -3.17277 2.608983 -0.706677
H  -5.109615 -1.997587 1.590722
H  -3.558141 -2.606414 0.956742
H  -3.568203 -1.395396 2.27293
H  -4.893765 -0.184438 -1.713246
H  -5.824594 -1.398097 -0.765511
H  -4.257124 -1.840888 -1.500117
H  1.547002 0.83898 -2.797311
H  3.505489 2.315194 1.553263
H  2.545209 3.103404 -2.606466
H  3.582398 3.84875 -0.428638
