program: Gaussian 16
title: First fragment in Amendola Capsule
version: ES64L-G16RevC.02
method: RM062X
basis: 6-31+G(d)
operation: Freq
keyword: #P
keyword: Geom=AllCheck
keyword: Guess=TCheck
keyword: SCRF=Check
keyword: GenChk
keyword: RM062X/6-31+G(d)
keyword: Freq
converged: YES YES YES YES
title: Mulliken charges:
elementType: N N N N N C C C C C C C C C C C C C C C C C C C C C C C C C C C C C C C C C C C C C C C C C C H H H H H H H H H H H H H H H H H H H H H H H H H H H H H H H H H H H H H H H H H H H H H H H H H H H N N N C C C C C C C C C C C C C C C C C C C C C C C C H H H H H H H H H H H H H H H H H H H H H
charge: -0.157261 -0.091678 -0.089341 -0.094025 -0.092197 0.015351 -0.648561 -0.650666 0.009254 -0.515811 -0.523472 -0.871540 -0.863237 -0.880429 0.437916 0.137145 -0.504264 -0.452613 0.087219 -0.340690 0.478553 0.123454 -0.543834 -0.461773 0.114078 -0.339963 0.354189 0.115444 -0.517223 -0.447445 0.140672 -0.308206 -0.042931 -0.050831 -0.045136 0.015337 -0.659372 -0.652169 0.014796 -0.520723 -0.519914 0.007675 -0.642113 -0.655972 0.014475 -0.522448 -0.516526 0.225571 0.242746 0.226227 0.223083 0.226398 0.226458 0.222994 0.234332 0.242654 0.237745 0.237544 0.278186 0.238285 0.278501 0.238716 0.280011 0.261091 0.253262 0.234257 0.235289 0.260075 0.253930 0.234429 0.235445 0.261871 0.253632 0.234287 0.235278 0.207761 0.208103 0.208234 0.225674 0.242806 0.225730 0.223078 0.226374 0.226400 0.223080 0.236549 0.242733 0.236713 0.226317 0.242777 0.225527 0.223004 0.226356 0.226379 0.223059 0.237566 0.242671 0.234056 -0.156947 -0.093324 -0.089358 -0.872768 -0.867457 -0.866082 0.480460 0.127573 -0.543703 -0.465028 0.109603 -0.333959 0.358751 0.111278 -0.521051 -0.447606 0.139010 -0.307086 0.431097 0.136408 -0.501228 -0.453383 0.087073 -0.342799 -0.049660 -0.048546 -0.045020 0.238363 0.280078 0.237538 0.277875 0.238161 0.278540 0.260128 0.254238 0.234392 0.235317 0.261889 0.253019 0.234223 0.235263 0.261489 0.253251 0.234282 0.235380 0.207907 0.208251 0.207730
chargesum: -0.00000
title: Mulliken charges with hydrogens summed into heavy atoms:
elementType: N N N N N C C C C C C C C C C C C C C C C C C C C C C C C C C C C C C C C C C C C C C C C C C N N N C C C C C C C C C C C C C C C C C C C C C C C C
charge: -0.157261 -0.091678 -0.089341 -0.094025 -0.092197 0.483576 -0.410816 -0.416334 0.478227 -0.066330 -0.074020 -0.355810 -0.346451 -0.361703 0.437916 0.398236 -0.251002 -0.218356 0.087219 -0.105401 0.478553 0.383529 -0.289904 -0.227344 0.114078 -0.104518 0.354189 0.377314 -0.263590 -0.213158 0.140672 -0.072928 0.164830 0.157272 0.163097 0.483744 -0.422659 -0.415620 0.483332 -0.071271 -0.070434 0.476663 -0.408057 -0.418406 0.482779 -0.073087 -0.067089 -0.156947 -0.093324 -0.089358 -0.354327 -0.352043 -0.349381 0.480460 0.387701 -0.289465 -0.230636 0.109603 -0.098642 0.358751 0.373167 -0.268032 -0.213382 0.139010 -0.071823 0.431097 0.397897 -0.247977 -0.219100 0.087073 -0.107419 0.158247 0.159706 0.162709
polarizability: 1.05238576e+03 -1.07552176e+01 1.04591571e+03 7.81092333e-01 8.10649128e-01 1.11016873e+03
1716.lowfreq: -0.0009 0.0002 0.0013 1.4736 3.0168 3.4209 6.0452 8.1537 16.0141
temp: 298.150 k
press: 1.00000 atm
elementType: 7 7 7 7 7 6 6 6 6 6 6 6 6 6 6 6 6 6 6 6 6 6 6 6 6 6 6 6 6 6 6 6 6 6 6 6 6 6 6 6 6 6 6 6 6 6 6 1 1 1 1 1 1 1 1 1 1 1 1 1 1 1 1 1 1 1 1 1 1 1 1 1 1 1 1 1 1 1 1 1 1 1 1 1 1 1 1 1 1 1 1 1 1 1 1 1 1 1 7 7 7 6 6 6 6 6 6 6 6 6 6 6 6 6 6 6 6 6 6 6 6 6 6 6 6 1 1 1 1 1 1 1 1 1 1 1 1 1 1 1 1 1 1 1 1 1
symmnumber: 1
zpe: 3313872.9 jmol-1
zpe.correction: 1.262188 hartree
zpe.thermalcorrener: 1.325882 hartree
zpe.thermalcorrenthalpy: 1.326826 hartree
zpe.thermalcorrgfe: 1.158239 hartree
zpe.sumelectzpe: -2993.987524 hartree
zpe.sumelectthermal: -2993.923830 hartree
zpe.sumelectthermalent: -2993.922886 hartree
zpe.sumelectthermalfe: -2994.091473 hartree
dipole: -0.0590 0.0196 -0.0174
dipole: 0.0646
quadrupole: -390.2944 -391.5833 -406.4506
quadrupole: -2.0656 -0.2097 -0.3533
quadrupole: 5.8151 4.5261 -10.3412 -2.0656 -0.2097 -0.3533
hfenergy: -2995.249712 hartree
pointgroup: C01 [X(C66H72N8)]
dipole: -0.0232149 0.0077016 -0.0068516 debye
polarizability: 1052.3857578|-10.7552176|1045.9157141|0.7810923|0.8106491|1110.1687324 unknown
InChI: InChI=1S/C66H72N8/c1-2-26-62-61(25-1)67-37-49-13-7-19-55(31-49)43-73-45-57-21-9-15-51(33-57)39-69-63-27-3-5-29-65(63)71-41-53-17-11-23-59(35-53)47-74(44-56-20-8-14-50(32-56)38-68-62)48-60-24-12-18-54(36-60)42-72-66-30-6-4-28-64(66)70-40-52-16-10-22-58(34-52)46-73/h7-24,31-42,61-66H,1-6,25-30,43-48H2
charge 0 multiplicity 1
146 atoms
N  0.03415568 -0.047909 3.07722039
N  5.17205179 -3.85989158 1.40729224
N  0.64580468 6.33111498 1.41374763
N  -5.87976956 -2.44557793 1.41864078
N  5.25515623 -3.74639921 -1.41611285
C  -8.1579348 -3.41019433 1.45855693
C  -7.12381897 -2.60242628 0.66538811
C  -6.83808514 -3.29392953 -0.66936659
C  -8.13198329 -3.40813272 -1.48409752
C  -9.19756401 -4.18824762 -0.71037567
C  -9.45645122 -3.5647583 0.66319245
C  -0.89322403 -1.08906568 2.63738734
C  1.38931384 -0.33125259 2.60895768
C  -0.40881566 1.26655634 2.6175997
C  2.0037009 -1.5576197 3.25055175
C  1.67062007 -1.94530149 4.55406073
C  2.91804731 -2.32702075 2.53210467
C  2.21757367 -3.10017983 5.11109196
C  3.472833 -3.4870803 3.0836645
C  3.10102812 -3.88444878 4.37156369
C  -2.25913742 -0.98462718 3.28196762
C  -2.41182702 -0.51295684 4.59165001
C  -3.39462725 -1.35324273 2.56217529
C  -3.68043252 -0.38275618 5.15395794
C  -4.67235174 -1.22566847 3.11871497
C  -4.8130822 -0.71699962 4.41321193
C  0.35651848 2.41497502 3.24119603
C  0.90945126 2.31664541 4.52366781
C  0.52078297 3.60091871 2.52605828
C  1.64128752 3.37381835 5.06239652
C  1.25238001 4.66751668 3.05958704
C  1.83277093 4.54102622 4.32541039
C  1.47777606 5.89722412 2.26956944
C  4.38997039 -4.3326215 2.28910312
C  -5.87402763 -1.55152411 2.32059066
C  7.19767499 -5.27662234 1.46606467
C  5.97218073 -4.82982542 0.66014453
C  6.42038149 -4.21884672 -0.66926461
C  7.21457148 -5.25254621 -1.4765589
C  8.43349781 -5.74057573 -0.68997487
C  8.0283124 -6.29284548 0.67865646
C  0.75482169 8.79770311 1.48413893
C  1.04055934 7.52828567 0.67303876
C  0.29203531 7.58367892 -0.66028692
C  0.74094371 8.81335326 -1.4585807
C  0.49065573 10.09901578 -0.66690438
C  1.16761314 10.04876536 0.70476367
H  -8.35027847 -2.90979436 2.41503377
H  -8.49355171 -2.39631643 -1.71670027
H  -7.91307355 -3.89937839 -2.43967102
H  -10.12623432 -4.2283283 -1.29097969
H  -8.85783293 -5.22519872 -0.57832871
H  -9.91532358 -2.57491454 0.5298728
H  -10.17067653 -4.17385985 1.22888992
H  -6.46988775 -4.31044234 -0.45128502
H  -7.73300961 -4.39727748 1.69037029
H  -7.54758713 -1.6083475 0.44608845
H  -1.01100398 -1.07435794 1.53696172
H  -0.45383836 -2.06069407 2.89103474
H  1.41020475 -0.45073372 1.50886677
H  2.01467282 0.53900263 2.8391653
H  -0.34010184 1.34375315 1.51546733
H  -1.47005945 1.37204424 2.87095226
H  0.95168332 -1.35435987 5.1158679
H  3.18557542 -2.04987503 1.51452773
H  1.938659 -3.39930206 6.11768599
H  3.50671545 -4.80179997 4.7925211
H  -1.53066664 -0.21431074 5.15396256
H  -3.30132149 -1.71332225 1.53979717
H  -3.78707974 -0.0008342 6.16550192
H  -5.80607762 -0.58786563 4.83813721
H  0.79180364 1.39175049 5.08269247
H  0.1068193 3.69770757 1.52454075
H  2.07928017 3.27887041 6.0521408
H  2.42773716 5.35629507 4.73117016
H  2.4319074 6.41495054 2.45801651
H  4.341931 -5.41346101 2.49725227
H  -6.77039965 -0.95086377 2.54308496
H  6.86605142 -5.70689312 2.41852374
H  6.55288322 -6.09684458 -1.71731482
H  7.5248053 -4.80504476 -2.42831536
H  8.96788413 -6.50512731 -1.26536392
H  9.12938917 -4.90146033 -0.54939381
H  7.43621979 -7.20814029 0.53802516
H  8.91795828 -6.57376114 1.25378797
H  7.0822704 -3.36633134 -0.44254429
H  7.8046485 -4.39182401 1.70560093
H  5.35790552 -5.71714251 0.43362772
H  1.29304018 8.74342971 2.4379795
H  1.81023487 8.71171492 -1.69289225
H  0.20310912 8.83930155 -2.41371884
H  0.84895565 10.96419272 -1.23630524
H  -0.59197736 10.23162769 -0.53095417
H  2.2583308 10.04344204 0.56909017
H  0.92235721 10.94679502 1.2831376
H  -0.7835942 7.68226158 -0.43856011
H  -0.31831736 8.83230121 1.72031311
H  2.12062171 7.48816737 0.45311645
N  0.0622849 -0.014122 -3.07472901
N  0.52391789 6.34996498 -1.41099166
N  -5.81747435 -2.55055894 -1.40673487
C  -1.32327583 0.00315955 -2.61132371
C  0.76927436 1.1868481 -2.63317591
C  0.74796188 -1.2187748 -2.61234096
C  0.24829879 2.45529056 -3.27474508
C  -0.2460019 2.45709895 -4.58507393
C  0.24676588 3.64748356 -2.55244729
C  -0.761539 3.62423543 -5.14576985
C  -0.26846392 4.82425952 -3.10780875
C  -0.79440949 4.80335318 -4.40289638
C  -2.18387623 -1.07380006 -3.23758542
C  -1.9266038 -1.56235615 -4.52423421
C  -3.25944706 -1.59720927 -2.52107567
C  -2.71212252 -2.57874216 -5.0660637
C  -4.05402316 -2.61581866 -3.0578528
C  -3.76226985 -3.12190338 -4.32822289
C  2.10382559 -1.4243017 -3.25437905
C  2.37282494 -0.97974076 -4.55454609
C  3.1146239 -2.06535492 -2.53939943
C  3.63985474 -1.1455801 -5.11173206
C  4.38875713 -2.23732494 -3.0912087
C  4.6552385 -1.75382636 -4.37577232
C  5.47133631 -2.8593032 -2.29875499
C  -0.32823044 6.0673519 -2.30922638
C  -5.15398478 -3.20815122 -2.26705312
H  -1.3726532 -0.0906764 -1.50944323
H  -1.74940837 0.98227018 -2.85883599
H  0.72134701 1.29195845 -1.53240339
H  1.82835854 1.06814713 -2.88937993
H  0.86815004 -1.20766624 -1.51217613
H  0.11187545 -2.08011897 -2.8467651
H  -0.25694342 1.52775215 -5.14901499
H  0.61637833 3.6679264 -1.52933986
H  -1.15670382 3.60948954 -6.15774065
H  -1.22367652 5.70861068 -4.8266883
H  -1.08454281 -1.16371136 -5.08446493
H  -3.47437028 -1.2394282 -1.51630362
H  -2.49240575 -2.96046473 -6.05928527
H  -4.35947365 -3.93412294 -4.73670416
H  1.59141132 -0.47082966 -5.11332469
H  2.93178247 -2.41187193 -1.52441831
H  3.84063519 -0.78185675 -6.11566208
H  5.65293842 -1.8585107 -4.79640436
H  6.48791179 -2.48963038 -2.5080072
H  -1.17740956 6.73405279 -2.52862173
H  -5.35792337 -4.2735803 -2.4593712
