program: Gaussian 09
title: 000005411
version: EM64L-G09RevD.01
frameworkgroup: C1[X(C15H24N2O2)]
method: RPBEPBE
basis: SDD
operation: Freq
keyword: #p
keyword: freq=noraman
keyword: PBEPBE/SDD
title: #p freq=noraman PBEPBE/SDD
converged: YES YES NO NO
title: Mulliken charges:
elementType: O O N N C C C C C C C C C C C C C C C H H H H H H H H H H H H H H H H H H H H H H H H
charge: -0.299402 -0.272809 -0.420703 -0.089492 -0.424932 -0.338722 -0.338345 0.472411 -0.360948 -0.259533 -0.687008 0.223242 -0.421640 -0.364038 -0.323747 -0.362598 0.177134 -0.612421 -0.614317 0.205191 0.204189 0.214401 0.214360 0.198610 0.198602 0.299252 0.220885 0.192505 0.237674 0.228117 0.210781 0.221383 0.210546 0.215916 0.242652 0.263279 0.263457 0.227539 0.187205 0.221796 0.228907 0.222967 0.187657
chargesum: 0.00000
title: Mulliken charges with hydrogens summed into heavy atoms:
elementType: O O N N C C C C C C C C C C C C C C C
charge: -0.299402 -0.272809 -0.121451 -0.089492 -0.015552 0.090039 0.058867 0.472411 0.052442 0.206258 -0.044298 0.223242 -0.205724 -0.121387 -0.060468 -0.099142 0.177134 0.024119 0.025214
polarizability: 3.24872645e+02 1.23237513e+01 1.73953360e+02 -3.24752928e+00 1.34507845e-01 1.15208594e+02
1716.lowfreq: -3.6517 -0.0407 -0.0011 0.0016 3.9500 14.9537 18.5638 33.6277 34.7152
frequency: 17.7929 33.2415 33.9245 36.3041 60.7296 67.0187 76.3691 83.6336 95.4870 118.6799 137.2162 148.9257 163.2823 173.9885 216.5605 224.8088 225.2674 249.2392 265.5234 278.7624 296.8246 346.0646 371.0313 378.5265 398.6731 420.8455 430.3217 433.8975 504.9044 507.5959 533.2819 631.1970 638.4448 676.1632 739.6674 753.1476 767.8326 799.2476 803.2216 821.3491 822.7206 839.2588 839.6848 905.9593 930.2311 946.1205 970.9535 984.2326 995.7741 1022.8872 1032.1859 1035.3031 1055.8861 1067.5136 1079.1244 1089.2651 1090.2730 1098.0359 1115.0820 1140.2739 1143.4626 1154.3122 1172.4549 1181.3044 1221.2334 1233.0659 1254.3042 1261.2233 1266.4899 1282.1636 1285.9749 1293.4147 1297.1119 1314.7531 1327.0878 1348.6181 1369.9491 1375.0171 1386.0133 1392.2605 1421.8760 1443.5484 1443.8799 1462.6613 1465.8878 1469.6085 1473.3153 1475.0488 1475.7780 1476.7083 1477.6430 1483.7141 1486.8653 1487.8674 1501.3586 1529.1794 1570.1997 1611.1566 1633.9101 2847.0886 2855.1044 2873.4197 2934.3363 2962.9316 2972.5828 2976.4338 2976.5873 3009.7213 3015.6469 3019.4161 3030.0975 3037.9647 3038.5657 3073.1064 3078.0965 3078.2337 3084.5251 3090.2407 3116.0270 3143.9439 3164.6364 3172.0592 3560.0533
redmass: 4.2450 3.1858 3.7847 3.4093 2.1535 3.8441 2.7250 2.5565 2.8618 2.5759 3.0019 3.2831 3.8936 3.7486 1.2595 1.5570 1.1432 1.7316 4.5227 3.7311 4.7261 2.5111 3.4388 1.1934 3.6166 2.7985 2.9121 2.8563 3.9194 2.8250 4.6017 7.0458 6.3502 4.0369 1.0738 4.5760 6.9716 1.1772 1.1591 1.2725 4.5714 3.3341 2.1476 1.8112 7.5011 1.1574 1.3521 1.3467 3.1949 3.6278 2.2871 1.5182 4.2379 1.7198 2.3582 2.8572 1.6257 1.8843 1.6806 1.4576 2.1302 1.5576 1.3987 1.1569 1.3080 1.7436 2.0982 1.4968 2.5932 1.1460 1.2710 1.0668 1.4323 1.5436 1.4560 1.5790 1.9982 2.5673 1.4958 1.2185 1.1428 4.1793 1.1688 1.0497 1.0689 1.1482 1.4103 1.0665 1.1900 1.0605 1.0424 1.0682 1.0796 1.0646 1.1005 3.3725 5.0577 10.1148 6.6374 1.0572 1.0613 1.0660 1.0571 1.0584 1.1027 1.0360 1.0597 1.1009 1.0576 1.0722 1.0722 1.1043 1.0882 1.1010 1.0993 1.1017 1.1041 1.1038 1.0896 1.0874 1.0957 1.0949 1.0769
irintensity: 0.0206 0.7252 0.0064 0.0395 2.0002 0.6146 0.0519 1.7407 0.7038 0.8883 0.4328 1.0667 0.1271 5.1165 0.1136 3.0681 0.1488 1.1550 0.5946 12.0384 2.1457 16.2078 0.0912 85.9520 5.1420 3.1477 8.9632 1.0357 10.8641 6.7474 2.2938 1.4603 15.0351 27.5437 10.1912 13.5514 24.1720 1.8418 0.0695 5.0441 8.6060 37.3327 30.9333 10.6695 19.6605 0.1817 0.6041 0.5837 32.4542 0.4767 51.5224 18.9170 425.0692 78.2617 1.1741 1.0887 3.9463 8.6559 17.1152 4.1668 22.0656 0.5078 12.3013 235.8908 0.1165 17.7446 297.0973 77.5593 1.2548 0.4066 6.8404 0.2649 25.1428 13.9722 27.4161 26.5032 36.5338 151.1072 28.9739 8.4598 2.5770 9.8824 3.4549 11.6132 7.3974 11.8932 9.2998 10.3966 1.4200 10.0288 13.5853 11.2199 19.1064 17.9055 62.9955 166.5428 54.0222 383.4178 363.6757 72.4681 111.9737 173.1141 51.5177 10.9917 20.7996 43.9350 60.4898 3.6698 17.0069 44.5425 58.6332 48.0797 10.4547 83.6039 48.1578 19.4922 58.7212 40.1736 19.6632 4.7524 19.4843 3.0975 57.0996
temp: 298.150 k
press: 1.00000 atm
elementType: 8 8 7 7 6 6 6 6 6 6 6 6 6 6 6 6 6 6 6 1 1 1 1 1 1 1 1 1 1 1 1 1 1 1 1 1 1 1 1 1 1 1 1
symmnumber: 1
zpe: 963478.3 jmol-1
zpe.correction: 0.366970 hartree
zpe.thermalcorrener: 0.388729 hartree
zpe.thermalcorrenthalpy: 0.389673 hartree
zpe.thermalcorrgfe: 0.313353 hartree
zpe.sumelectzpe: -844.459999 hartree
zpe.sumelectthermal: -844.438240 hartree
zpe.sumelectthermalent: -844.437296 hartree
zpe.sumelectthermalfe: -844.513616 hartree
dipole: -4.2037 -3.6184 0.9275
dipole: 5.6235
quadrupole: -80.1353 -116.2979 -119.0654
quadrupole: -6.4918 4.5137 1.6126
quadrupole: 25.0309 -11.1317 -13.8992 -6.4918 4.5137 1.6126
hfenergy: -844.8269689 hartree
pointgroup: C01 [X(C15H24N2O2)]
dipole: -1.6592732 1.4192424 -0.3571164 debye
polarizability: 324.9557567|-12.0355399|173.9089432|1.6622694|0.0243302|115.1698996 unknown
InChI: InChI=1S/C15H24N2O2/c1-4-5-10-16-14-8-6-13(7-9-14)15(18)19-12-11-17(2)3/h6-9,16H,4-5,10-12H2,1-3H3
charge 0 multiplicity 1
43 atoms
O  2.726706 -0.029822 0.142885
O  2.118325 -2.282634 0.211341
N  -3.643171 0.760961 -0.011516
N  6.428124 0.535919 0.053316
C  -6.120058 0.715713 -0.046477
C  -4.821627 -0.113717 -0.012933
C  -7.385899 -0.17064 -0.050778
C  -2.33078 0.312512 0.028662
C  4.976175 0.809419 -0.056353
C  4.148903 -0.455418 0.205444
C  -8.689015 0.656172 -0.079857
C  0.390625 -0.563443 0.113322
C  -1.253458 1.256207 0.026419
C  -2.014438 -1.082268 0.073545
C  0.077968 0.825045 0.067616
C  -0.676283 -1.501306 0.115515
C  1.777797 -1.070527 0.160861
C  7.213117 1.760598 0.307971
C  6.967157 -0.230813 -1.089669
H  -6.148265 1.390427 0.833951
H  -6.122087 1.360661 -0.949525
H  -4.819438 -0.758715 0.8920
H  -4.794247 -0.792426 -0.892675
H  -7.355782 -0.846746 -0.92888
H  -7.379283 -0.82165 0.846579
H  -3.805162 1.767618 -0.045228
H  4.705851 1.560677 0.708044
H  4.693106 1.235534 -1.051973
H  4.366398 -0.869092 1.205855
H  4.315005 -1.249603 -0.54356
H  -8.759983 1.317396 0.804125
H  -9.579483 0.001956 -0.084114
H  -8.734654 1.294493 -0.982186
H  -1.479909 2.329571 -0.007926
H  -2.814678 -1.828161 0.075452
H  0.894359 1.552773 0.065792
H  -0.428062 -2.567678 0.151451
H  6.843806 2.2577 1.222368
H  7.171751 2.501325 -0.531504
H  8.272787 1.492638 0.470048
H  6.437048 -1.192168 -1.196503
H  8.033542 -0.455947 -0.910366
H  6.887108 0.319559 -2.062339
