program: Gaussian 16
title: First fragment in Amendola Capsule
version: ES64L-G16RevC.02
basis: 6-31+G(d)
method: RB3LYP
operation: Freq
keyword: #p
keyword: b3lyp/6-31+G(d)
keyword: Nosymm
keyword: SCRF=(SMD,solvent=chloroform)
keyword: freq
keyword: geom=checkpoint
keyword: guess=read
title: #p b3lyp/6-31+G(d) Nosymm SCRF=(SMD,solvent=chloroform) freq geom=chec
basis: NPDir=0 NMtPBC= 1 NCelOv= 1 NCel= 1 NClECP= 1 NCelD= 1
basis: NCelK= 1 NCelE2= 1 NClLst= 1 CellRange= 0.0.
basis: One-electron integrals computed using PRISM.
basis: NBasis= 1550 RedAO= T EigKep= 1.00D-06 NBF= 1550
basis: NBsUse= 1532 1.00D-06 EigRej= 8.21D-07 NBFU= 1532
converged: YES YES NO YES
title: Mulliken charges:
elementType: N N C C C C C C C C C C C C C C H H H H H H H H H H H H H H H H N N C C C C C C C C C C C C C C H H H H H H H H H H H H H H H H N N C C C C C C C C C C C C C C H H H H H H H H H H H H H H H H N C C C H H H H H H N C C C C C C C C C C C C C C C C C C C C C H H H H H H H H H H H H H H H H H H
charge: 0.003728 -0.022807 -0.179839 -0.192466 0.010798 -0.234385 -0.795781 -0.815515 -0.033517 -0.012858 0.089030 -0.622503 -0.057933 -0.510350 0.717981 -0.152492 0.220367 0.224535 0.217199 0.204967 0.208015 0.208462 0.204622 0.216915 0.183894 0.183793 0.222233 0.215280 0.202924 0.229774 0.204502 0.215011 -0.001318 -0.023030 -0.182762 -0.177241 0.001722 -0.229955 -0.796510 -0.806991 -0.037506 -0.006821 0.085828 -0.619906 -0.083982 -0.509512 0.718973 -0.146996 0.219397 0.224490 0.217036 0.204872 0.208021 0.208323 0.204660 0.216931 0.183690 0.184291 0.222719 0.215635 0.202924 0.229960 0.204425 0.215376 -0.000578 -0.022063 -0.181844 -0.182768 0.001369 -0.231126 -0.796546 -0.806805 -0.031961 -0.007870 0.091951 -0.625696 -0.073068 -0.499026 0.706115 -0.150761 0.219349 0.224579 0.217060 0.204927 0.208053 0.208313 0.204692 0.216886 0.183787 0.184147 0.222859 0.215603 0.202875 0.229749 0.204355 0.215063 0.354773 -0.999194 -1.002408 -1.005091 0.203527 0.238755 0.203618 0.239518 0.203308 0.239374 0.371672 -1.224286 -1.234442 -1.215635 0.848887 -0.098565 -0.019440 -0.573049 0.107575 -0.566383 0.838667 -0.107497 -0.029029 -0.557403 0.112052 -0.567433 0.843455 -0.109524 -0.035934 -0.558746 0.106100 -0.553574 0.239552 0.204364 0.239967 0.204334 0.239106 0.204407 0.217047 0.230342 0.204152 0.202881 0.216929 0.230040 0.204189 0.202842 0.216627 0.230598 0.204168 0.202857
chargesum: -0.00000
title: Mulliken charges with hydrogens summed into heavy atoms:
elementType: N N C C C C C C C C C C C C C C N N C C C C C C C C C C C C C C N N C C C C C C C C C C C C C C N C C C N C C C C C C C C C C C C C C C C C C C C C
charge: 0.003728 -0.022807 0.262761 0.022814 0.227713 0.207349 -0.382799 -0.402431 0.150377 0.170936 0.089030 -0.419580 0.171841 -0.305848 0.717981 0.062520 -0.001318 -0.023030 0.259354 0.038394 0.218654 0.211571 -0.383618 -0.394008 0.146184 0.177470 0.085828 -0.416982 0.145978 -0.305087 0.718973 0.068380 -0.000578 -0.022063 0.260364 0.032835 0.218256 0.210513 -0.383566 -0.393800 0.151826 0.176277 0.091951 -0.422821 0.156681 -0.294671 0.706115 0.064302 0.354773 -0.556913 -0.559273 -0.562408 0.371672 -0.780370 -0.790140 -0.772122 0.848887 0.118482 0.210902 -0.368897 0.107575 -0.363502 0.838667 0.109432 0.201011 -0.353213 0.112052 -0.364591 0.843455 0.107103 0.194664 -0.354578 0.106100 -0.350717
chargesum: 0.00000
polarizability: 1.04934916e+03 2.23999077e+01 1.06431949e+03 4.80632936e+01 8.63227075e+01 1.26527698e+03
1716.lowfreq: -2.5047 -0.0011 0.0005 0.0012 2.0823 3.6396 6.6851 7.7807 10.4303
temp: 298.150 k
press: 1.00000 atm
elementType: 7 7 6 6 6 6 6 6 6 6 6 6 6 6 6 6 1 1 1 1 1 1 1 1 1 1 1 1 1 1 1 1 7 7 6 6 6 6 6 6 6 6 6 6 6 6 6 6 1 1 1 1 1 1 1 1 1 1 1 1 1 1 1 1 7 7 6 6 6 6 6 6 6 6 6 6 6 6 6 6 1 1 1 1 1 1 1 1 1 1 1 1 1 1 1 1 7 6 6 6 1 1 1 1 1 1 7 6 6 6 6 6 6 6 6 6 6 6 6 6 6 6 6 6 6 6 6 6 1 1 1 1 1 1 1 1 1 1 1 1 1 1 1 1 1 1
symmnumber: 1
zpe: 3286290.9 jmol-1
zpe.correction: 1.251682 hartree
zpe.thermalcorrener: 1.315605 hartree
zpe.thermalcorrenthalpy: 1.316549 hartree
zpe.thermalcorrgfe: 1.147346 hartree
zpe.sumelectzpe: -2995.268171 hartree
zpe.sumelectthermal: -2995.204249 hartree
zpe.sumelectthermalent: -2995.203305 hartree
zpe.sumelectthermalfe: -2995.372508 hartree
dipole: 0.0246 0.0485 0.3053
dipole: 0.3101
quadrupole: -383.2585 -385.6263 -387.5187
quadrupole: 0.4379 -0.1371 -2.4421
quadrupole: 2.2093 -0.1585 -2.0508 0.4379 -0.1371 -2.4421
hfenergy: -2996.5198536 hartree
pointgroup: C01 [X(C66H72N8)]
dipole: 0.009665 0.0190936 0.1201135 debye
polarizability: 1049.3491627|22.3999077|1064.3194931|48.0632936|86.3227075|1265.276977 unknown
InChI: InChI=1S/C66H72N8/c1-2-26-62-61(25-1)67-37-49-13-7-19-55(31-49)43-73-45-57-21-9-15-51(33-57)39-69-63-27-3-5-29-65(63)71-41-53-17-11-23-59(35-53)47-74(44-56-20-8-14-50(32-56)38-68-62)48-60-24-12-18-54(36-60)42-72-66-30-6-4-28-64(66)70-40-52-16-10-22-58(34-52)46-73/h7-24,31-42,61-66H,1-6,25-30,43-48H2
charge 0 multiplicity 1
146 atoms
N  -2.02197278 -1.67282237 -0.56813873
N  -1.26453187 0.09157781 1.45532676
C  -4.48411913 -1.04836956 -0.29543084
C  -3.07198794 -1.15417786 0.31195361
C  -2.61998647 0.21985912 0.91387993
C  -3.68876848 0.77744912 1.87442923
C  -5.08125257 0.85820223 1.23609511
C  -5.51473351 -0.51067761 0.70465839
C  -0.97697725 0.46626146 2.64088635
C  -2.24532329 -1.92748297 -1.79869893
C  -1.19722332 -2.43251706 -2.71115281
C  -1.54101958 -2.75225595 -4.03289469
C  0.13767554 -2.59337729 -2.29601406
C  -0.56792809 -3.2257996 -4.91908221
C  1.11881045 -3.06025257 -3.17214825
C  0.75205853 -3.37730602 -4.49345267
H  -4.79526739 -2.03615939 -0.66027205
H  -3.74495327 0.13599201 2.76644774
H  -3.38359771 1.77403952 2.21884602
H  -5.80247878 1.23425223 1.97384258
H  -5.06888355 1.58395203 0.40902225
H  -5.62120335 -1.21417612 1.5440489
H  -6.49878965 -0.44433696 0.22192802
H  -2.52700179 0.90838338 0.05901563
H  -1.70881019 0.91616122 3.32404119
H  -3.22591516 -1.79102534 -2.27273646
H  -4.46222039 -0.37915051 -1.16791247
H  -3.1126404 -1.85744821 1.15838099
H  -2.569598 -2.62961438 -4.36686782
H  0.39821587 -2.33964826 -1.27207105
H  -0.8398021 -3.46991455 -5.94332894
H  1.5082779 -3.73971646 -5.1854862
N  7.9787933 -0.56101358 -3.20901161
N  9.13223428 -0.34577756 -0.67521801
C  9.69028284 1.04789792 -4.21019731
C  8.91555456 0.54086331 -2.97850893
C  9.89755067 0.15714467 -1.81976295
C  10.88252 1.30673327 -1.52914939
C  11.62824633 1.78453784 -2.78149669
C  10.64089477 2.20325453 -3.87398685
C  9.31104846 0.11204089 0.50247043
C  7.85363965 -1.10860352 -4.3549586
C  6.92571091 -2.23352061 -4.60010739
C  6.78754123 -2.73429447 -5.90292927
C  6.18312442 -2.82328253 -3.56054432
C  5.92147352 -3.80263633 -6.15825089
C  5.32043567 -3.89368709 -3.8013374
C  5.19527994 -4.38005023 -5.11616917
H  8.97599518 1.36396359 -4.98177863
H  10.33218661 2.15666276 -1.09912176
H  11.60726659 0.98163027 -0.77156606
H  12.29191717 2.61883071 -2.51812059
H  12.27233233 0.97691218 -3.16071592
H  10.06184295 3.07410464 -3.53171701
H  11.17621126 2.51693478 -4.7800026
H  10.47209944 -0.70856737 -2.18563404
H  10.0412702 0.89684693 0.73755833
H  8.42070928 -0.79102441 -5.2396204
H  10.27854894 0.22359306 -4.63943664
H  8.29923864 1.36822208 -2.59303559
H  7.35769583 -2.2876412 -6.71526551
H  6.29822728 -2.43134854 -2.55369497
H  5.81958413 -4.18824188 -7.16995064
H  4.52802921 -5.21488968 -5.31575362
N  4.56972271 -9.44358276 0.87870131
N  4.19128858 -8.67169493 3.53715114
C  5.29070196 -11.78993473 1.58133382
C  5.14380433 -10.29451052 1.92285833
C  4.33922466 -10.10251344 3.25354359
C  4.93418255 -10.96348553 4.38520676
C  5.06900139 -12.44278495 4.00254994
C  5.90492505 -12.59950305 2.72955498
C  4.49304282 -8.18090368 4.67595528
C  4.15892272 -9.92230644 -0.23064494
C  3.55430575 -9.07912717 -1.28436585
C  3.18122135 -9.66940083 -2.50075619
C  3.33036334 -7.70245739 -1.09785674
C  2.5975351 -8.8956036 -3.50930483
C  2.7435122 -6.92078021 -2.09410571
C  2.37782945 -7.53263475 -3.30775824
H  5.90596393 -11.89543134 0.67817861
H  5.92822132 -10.5755368 4.6528224
H  4.30587797 -10.87100947 5.28048331
H  5.52201157 -12.99779181 4.83477516
H  4.07088534 -12.87677203 3.84037741
H  6.93247773 -12.25485561 2.9198896
H  5.97536858 -13.65647195 2.44030218
H  3.31924103 -10.46168117 3.04336028
H  4.87308595 -8.78577388 5.50926768
H  4.21899046 -10.98806 -0.48668381
H  4.30276848 -12.211698 1.34454909
H  6.14758315 -9.88281711 2.11234094
H  3.34668475 -10.73383407 -2.65613684
H  3.61849042 -7.25244556 -0.15173822
H  2.30800754 -9.35918377 -4.44945989
H  1.91688432 -6.93463035 -4.09003245
N  3.10360935 -4.55173267 -2.83246061
C  2.56143587 -3.18543687 -2.72066624
C  4.5673259 -4.54955036 -2.6595891
C  2.46318446 -5.44945653 -1.85443282
H  2.65303684 -2.80788099 -1.68514465
H  3.18439143 -2.53818947 -3.34758801
H  4.85183075 -4.06213049 -1.70845693
H  4.88509824 -5.59524701 -2.5837386
H  2.76113207 -5.18580909 -0.82244678
H  1.38259331 -5.28228948 -1.92142396
N  4.394672 -2.3022029 3.14462131
C  3.45284048 -3.42735534 3.28349434
C  5.66192418 -2.74468867 2.53606933
C  3.79389838 -1.19914195 2.37303158
C  6.79158877 -1.74058215 2.67686903
C  7.17824714 -1.27472183 3.94747121
C  7.48896513 -1.28833319 1.55485203
C  8.22967694 -0.3679527 4.0823476
C  8.55666628 -0.37894404 1.67573946
C  8.91489791 0.08423956 2.95044789
C  3.86291007 -4.43966409 4.33764564
C  4.08703947 -4.03413353 5.6666587
C  3.99368802 -5.79238977 4.01693852
C  4.44575819 -4.96417941 6.64246856
C  4.34915105 -6.74347541 4.99197639
C  4.58206652 -6.31483927 6.30712377
C  2.68435562 -0.47164167 3.11031555
C  2.92913603 0.12171275 4.36293115
C  1.41165279 -0.35321475 2.54825721
C  1.91554874 0.80372778 5.03644302
C  0.38022277 0.33606361 3.21350848
C  0.64201724 0.90631068 4.46802228
H  2.48194559 -3.0030224 3.56283578
H  3.30539531 -3.94460611 2.31723846
H  5.95379046 -3.67381299 3.0384308
H  5.52448382 -2.99313899 1.46728383
H  4.59606847 -0.48611739 2.15209147
H  3.41167524 -1.55722178 1.39907724
H  6.64731619 -1.62514757 4.82864794
H  7.20853478 -1.63346454 0.56320552
H  8.51844335 -0.01382066 5.06919096
H  9.73345784 0.79399378 3.05475268
H  3.98235912 -2.98467791 5.92928207
H  3.82538122 -6.12946256 2.99759425
H  4.61764135 -4.63905793 7.66588628
H  4.86457407 -7.04020589 7.06768786
H  3.91753547 0.04142806 4.80790868
H  1.19871053 -0.80406733 1.58266453
H  2.11603064 1.25713079 6.00436648
H  -0.15061972 1.43409203 4.99512114
