program: Gaussian 16
title: First fragment in Amendola Capsule
version: ES64L-G16RevC.02
basis: 6-31+G(d)
method: RB3LYP
operation: Freq
keyword: #p
keyword: b3lyp/6-31+G(d)
keyword: Nosymm
keyword: Freq
keyword: SCRF=(SMD,solvent=chloroform)
keyword: geom=checkpoint
keyword: guess=read
title: #p b3lyp/6-31+G(d) Nosymm Freq SCRF=(SMD,solvent=chloroform) geom=chec
basis: NPDir=0 NMtPBC= 1 NCelOv= 1 NCel= 1 NClECP= 1 NCelD= 1
basis: NCelK= 1 NCelE2= 1 NClLst= 1 CellRange= 0.0.
basis: One-electron integrals computed using PRISM.
basis: NBasis= 1550 RedAO= T EigKep= 1.03D-06 NBF= 1550
basis: NBsUse= 1535 1.00D-06 EigRej= 9.13D-07 NBFU= 1535
converged: YES YES YES YES
title: Mulliken charges:
elementType: N N N N C C C C C C C C C C C C C C C C C C C C C C C C C C C C C C C C C C C C C C C C C C H H H H H H H H H H H H H H H H H H H H H H H H H H H H H H H H H H H H H H H H H H H H H H H H H H H N N N N C C C C C C C C C C C C C C C C C C C C C C C C H H H H H H H H H H H H H H H H H H H H H
charge: 0.189531 0.192750 0.191421 0.211392 -0.200027 -0.233714 -0.356853 -0.716279 -0.429892 -0.417798 -0.352254 -0.201254 -0.251354 -0.345483 -0.709760 -0.429837 -0.413552 -0.357497 -0.241632 -0.213699 -0.415720 -0.429715 -0.705376 -0.339068 -0.358586 -1.098489 -1.102648 -1.096750 0.854578 -0.354611 -0.195460 0.309595 -0.382055 -0.432741 0.844073 -0.356786 -0.190847 0.310339 -0.380340 -0.427971 0.841766 -0.364481 -0.191353 0.327055 -0.383680 -0.427313 0.198145 0.224418 0.194198 0.207832 0.199829 0.197076 0.219768 0.224272 0.206228 0.241022 0.179598 0.198318 0.224453 0.195128 0.208077 0.199765 0.197095 0.219643 0.224369 0.205994 0.240337 0.179413 0.206064 0.194677 0.224552 0.219511 0.197134 0.199920 0.208141 0.240129 0.197815 0.224288 0.179591 0.231229 0.204434 0.231335 0.204184 0.231446 0.204268 0.237416 0.202355 0.204103 0.203982 0.237072 0.202510 0.204075 0.203998 0.237083 0.202447 0.204073 0.203937 0.298928 0.293778 0.298490 0.156640 -0.240316 -0.233863 -0.235114 -0.732636 -0.729921 -0.740634 0.661232 -0.205751 -0.055590 0.075776 -0.569482 -0.592228 0.678986 -0.186696 -0.062738 0.069580 -0.562011 -0.612056 0.685312 -0.202890 -0.064118 0.082728 -0.564206 -0.611678 0.185806 0.185650 0.185721 0.239028 0.195549 0.238801 0.195366 0.239019 0.195373 0.238077 0.200266 0.205089 0.205319 0.237796 0.200304 0.205124 0.205300 0.237827 0.200280 0.205088 0.205323
chargesum: -0.00000
title: Mulliken charges with hydrogens summed into heavy atoms:
elementType: N N N N C C C C C C C C C C C C C C C C C C C C C C C C C C C C C C C C C C C C C C C C C C N N N N C C C C C C C C C C C C C C C C C C C C C C C C
charge: 0.189531 0.192750 0.191421 0.211392 -0.005829 -0.009295 0.082314 -0.308618 -0.013047 0.012702 -0.172656 -0.006126 -0.026902 0.093172 -0.301918 -0.013099 0.016812 -0.178084 -0.017080 -0.019021 0.014632 -0.013070 -0.297315 0.098876 -0.178995 -0.662826 -0.667130 -0.661036 0.854578 -0.117195 0.006895 0.309595 -0.177952 -0.228760 0.844073 -0.119714 0.011663 0.310339 -0.176265 -0.223973 0.841766 -0.127399 0.011095 0.327055 -0.179607 -0.223376 0.298928 0.293778 0.298490 0.156640 -0.054510 -0.048213 -0.049393 -0.298060 -0.295754 -0.306242 0.661232 0.032326 0.144676 0.075776 -0.364393 -0.386909 0.678986 0.051100 0.137566 0.069580 -0.356887 -0.406756 0.685312 0.034936 0.136162 0.082728 -0.359119 -0.406356
chargesum: 0.00000
polarizability: 1.34123599e+03 8.45782791e+01 9.97743404e+02 7.20682744e+01 1.71179396e+01 9.93078633e+02
1716.lowfreq: -3.9278 -0.0004 0.0007 0.0011 1.9469 3.0476 12.9754 15.4033 16.3406
temp: 298.150 k
press: 1.00000 atm
elementType: 7 7 7 7 6 6 6 6 6 6 6 6 6 6 6 6 6 6 6 6 6 6 6 6 6 6 6 6 6 6 6 6 6 6 6 6 6 6 6 6 6 6 6 6 6 6 1 1 1 1 1 1 1 1 1 1 1 1 1 1 1 1 1 1 1 1 1 1 1 1 1 1 1 1 1 1 1 1 1 1 1 1 1 1 1 1 1 1 1 1 1 1 1 1 1 1 1 7 7 7 7 6 6 6 6 6 6 6 6 6 6 6 6 6 6 6 6 6 6 6 6 6 6 6 6 1 1 1 1 1 1 1 1 1 1 1 1 1 1 1 1 1 1 1 1 1
symmnumber: 1
zpe: 3286030.8 jmol-1
zpe.correction: 1.251583 hartree
zpe.thermalcorrener: 1.315271 hartree
zpe.thermalcorrenthalpy: 1.316216 hartree
zpe.thermalcorrgfe: 1.148603 hartree
zpe.sumelectzpe: -2995.269311 hartree
zpe.sumelectthermal: -2995.205623 hartree
zpe.sumelectthermalent: -2995.204679 hartree
zpe.sumelectthermalfe: -2995.372291 hartree
dipole: -0.2629 -0.0680 -0.0726
dipole: 0.2811
quadrupole: -379.1567 -418.4734 -418.9440
quadrupole: 9.8783 7.9152 1.8955
quadrupole: 26.3680 -12.9487 -13.4193 9.8783 7.9152 1.8955
hfenergy: -2996.5208942 hartree
pointgroup: C01 [X(C66H72N8)]
dipole: -0.1034162 -0.026764 -0.0285622 debye
polarizability: 1341.2359901|84.5782791|997.7434036|72.0682744|17.1179396|993.0786327 unknown
InChI: InChI=1S/C66H72N8/c1-2-26-62-61(25-1)67-37-49-13-7-19-55(31-49)43-73-45-57-21-9-15-51(33-57)39-69-63-27-3-5-29-65(63)71-41-53-17-11-23-59(35-53)47-74(44-56-20-8-14-50(32-56)38-68-62)48-60-24-12-18-54(36-60)42-72-66-30-6-4-28-64(66)70-40-52-16-10-22-58(34-52)46-73/h7-24,31-42,61-66H,1-6,25-30,43-48H2
charge 0 multiplicity 1
146 atoms
N  -5.23316062 1.19959804 2.40494811
N  -3.54154733 -1.62159227 -2.83024061
N  -3.85381565 -4.83842511 2.42911842
N  -0.00963539 -0.78037797 1.50228135
C  -6.67917 1.00347416 2.53003799
C  -6.92802656 -0.43991117 3.05514653
C  -6.49405849 -0.57388006 4.53029425
C  -7.09711121 0.4951553 5.45853605
C  -6.81664402 1.91022327 4.93017212
C  -7.29310722 2.0570308 3.4780291
C  -4.79773256 1.88214792 1.41920959
C  -4.88588556 -1.65403956 -3.41200714
C  -5.76029474 -0.60000867 -2.67369457
C  -5.32877153 0.83462014 -3.04550922
C  -5.26235642 1.09329501 -4.56094277
C  -4.37209855 0.05526467 -5.26092494
C  -4.83196114 -1.37167653 -4.92967696
C  -2.90458759 -2.72121899 -2.71921566
C  -5.2728046 -5.48732696 0.54443743
C  -5.08634154 -5.5526052 2.08723985
C  -5.02763207 -7.0145894 2.58239355
C  -3.96245176 -7.85323999 1.86156507
C  -4.17332478 -7.81600675 0.34024204
C  -4.22960651 -6.3674664 -0.17578845
C  -3.82935953 -4.16194181 3.51031156
C  -0.00618298 0.54751394 2.14328778
C  0.69299356 -0.77521428 0.20629157
C  0.4890729 -1.83603732 2.40247771
C  0.21734492 -1.87746194 -0.72375056
C  -1.05870618 -1.79499068 -1.29222475
C  1.01631848 -2.99149165 -1.02217711
C  -1.55367787 -2.80920263 -2.12532599
C  0.53421785 -4.01541355 -1.84610338
C  -0.75106232 -3.93433978 -2.38339371
C  -1.0193634 1.49792183 1.53008177
C  -2.3836179 1.28856024 1.75989654
C  -0.63102435 2.57722442 0.72201595
C  -3.3574874 2.11531796 1.18051468
C  -1.59087735 3.40796346 0.13168003
C  -2.94930548 3.17023457 0.34553002
C  -0.53998222 -2.26154552 3.43481312
C  -1.6552045 -3.00348134 3.029655
C  -0.41537506 -1.91860557 4.78962649
C  -2.65008139 -3.38280234 3.94290887
C  -1.40339501 -2.28312586 5.71184876
C  -2.52464311 -2.99839426 5.28954665
H  -6.71259501 -1.58336306 4.90202608
H  -6.28502644 -1.09684864 2.45159948
H  -7.16631255 1.09426117 1.54688626
H  -8.1834523 0.35663927 5.54975013
H  -6.68189985 0.3776857 6.46872713
H  -7.31835265 2.65663355 5.56069831
H  -5.73937357 2.11668203 4.98782547
H  -8.3859442 1.94439428 3.43791242
H  -7.06292889 3.05899244 3.09237707
H  -5.40147393 -0.47743502 4.54547824
H  -5.4829268 2.33795876 0.68555089
H  -5.97774526 1.56878368 -2.55086161
H  -5.56815187 -0.74483662 -1.60064058
H  -5.34670374 -2.64197816 -3.25879596
H  -6.26854038 1.0558589 -5.0012954
H  -4.8793923 2.10676558 -4.74217966
H  -4.39504161 0.20757523 -6.34843111
H  -3.32982366 0.19120932 -4.94188721
H  -5.8411799 -1.53386236 -5.33443968
H  -4.17615151 -2.11246006 -5.40587321
H  -4.32878168 0.98181715 -2.61941339
H  -3.33434506 -3.67505858 -3.06734725
H  -4.85561571 -7.01570701 3.66685411
H  -5.95538699 -5.06305193 2.55298601
H  -5.08832987 -4.44103493 0.26072787
H  -2.96263465 -7.46752953 2.10286237
H  -4.00041687 -8.88918292 2.2245777
H  -3.36230846 -8.35400003 -0.16912292
H  -5.10322164 -8.34809674 0.09509582
H  -3.25331778 -5.89630598 -0.00794561
H  -4.39343045 -6.34439512 -1.26089018
H  -6.01843487 -7.4615238 2.41739164
H  -4.69854001 -4.12567339 4.18760598
H  -0.26357612 0.40066689 3.19665769
H  1.00249202 1.0006765 2.11976528
H  0.49109891 0.18982028 -0.26863116
H  1.7883559 -0.8415431 0.34432742
H  0.7355924 -2.70267723 1.78147213
H  1.42406543 -1.52530235 2.90503651
H  -1.69387951 -0.9416363 -1.07373147
H  2.01660111 -3.06490063 -0.5997509
H  1.15933398 -4.87888293 -2.06044931
H  -1.13144719 -4.73492142 -3.01468301
H  -2.70549465 0.45811404 2.38140091
H  0.42635314 2.76376209 0.54445453
H  -1.27699145 4.23442591 -0.50136534
H  -3.6966014 3.80806636 -0.12239327
H  -1.77127951 -3.27785268 1.98530826
H  0.45309096 -1.35437904 5.12393056
H  -1.30045601 -2.00100787 6.75689621
H  -3.29904837 -3.27269052 6.00311845
N  -8.29316862 -0.83494895 2.6859223
N  -6.69481259 -5.69687255 0.24561047
N  -7.17010568 -0.97495282 -2.84155512
N  -11.68393676 -3.50331865 -0.82477055
C  -9.05403727 -1.46414602 3.4934865
C  -7.07947153 -6.41317691 -0.73705241
C  -8.07454888 -0.1085511 -3.08278431
C  -12.51697054 -2.60514603 -0.0062382
C  -11.89517276 -4.9136963 -0.45514337
C  -11.91768879 -3.2862894 -2.26292442
C  -10.83422459 -5.84888385 -1.00561388
C  -9.49799411 -5.70822696 -0.61411466
C  -11.17121804 -6.87175402 -1.90591974
C  -8.50100197 -6.558329 -1.11864065
C  -10.18936844 -7.7268574 -2.41653053
C  -8.85758365 -7.56417795 -2.03414108
C  -12.08144273 -2.53025772 1.44575987
C  -10.81733281 -2.03088173 1.77969421
C  -12.93673446 -2.95025791 2.47660322
C  -10.39437542 -1.96319717 3.11679169
C  -12.52994865 -2.88823235 3.81320521
C  -11.25962103 -2.40791666 4.13205747
C  -11.38818826 -1.95674678 -2.76825228
C  -10.01942593 -1.67158161 -2.70490206
C  -12.25471992 -0.99670005 -3.31398478
C  -9.51290593 -0.44380779 -3.16012198
C  -11.76496773 0.2304836 -3.77218746
C  -10.40129777 0.51135303 -3.68508572
H  -8.76395543 -1.6894093 4.5276972
H  -6.38078783 -6.96691752 -1.37735153
H  -7.85140985 0.95404932 -3.24315926
H  -12.44410123 -1.60585898 -0.44782183
H  -13.58322265 -2.89911134 -0.05508154
H  -11.87838655 -4.96661685 0.63839149
H  -12.89566597 -5.26246468 -0.77652241
H  -11.40859205 -4.09447642 -2.79829129
H  -12.99440185 -3.37018398 -2.50679936
H  -9.21650904 -4.91917712 0.07715836
H  -12.20720484 -6.99189418 -2.2167475
H  -10.46285474 -8.51097185 -3.11838426
H  -8.08926699 -8.21978 -2.43940063
H  -10.13907249 -1.70534118 0.99634942
H  -13.92271743 -3.33879754 2.22913681
H  -13.19931465 -3.22418297 4.60146714
H  -10.93398122 -2.37138262 5.16976539
H  -9.33360128 -2.39960237 -2.28153271
H  -13.32081092 -1.20789146 -3.36989825
H  -12.44830437 0.96822256 -4.18579537
H  -10.01810877 1.47044616 -4.02802241
