program: Gaussian 16
title: First fragment in Amendola Capsule
version: ES64L-G16RevC.02
basis: 6-31+G(d)
method: RB3LYP
operation: Freq
keyword: #p
keyword: b3lyp/6-31+G(d)
keyword: Nosymm
keyword: Freq
keyword: SCRF=(SMD,solvent=chloroform)
keyword: geom=checkpoint
keyword: guess=read
title: #p b3lyp/6-31+G(d) Nosymm Freq SCRF=(SMD,solvent=chloroform) geom=chec
basis: NPDir=0 NMtPBC= 1 NCelOv= 1 NCel= 1 NClECP= 1 NCelD= 1
basis: NCelK= 1 NCelE2= 1 NClLst= 1 CellRange= 0.0.
basis: One-electron integrals computed using PRISM.
basis: NBasis= 1550 RedAO= T EigKep= 1.06D-06 NBF= 1550
basis: NBsUse= 1536 1.00D-06 EigRej= 7.90D-07 NBFU= 1536
converged: YES YES YES YES
title: Mulliken charges:
elementType: N N N N C C C C C C C C C C C C C C C C C C C C C C C C C C C C C C C C C C C C C C C C C C H H H H H H H H H H H H H H H H H H H H H H H H H H H H H H H H H H H H H H H H H H H H H H H H H H H N C C C H H H H H H N C H C C C C H C H C H H N C H C C C C H C H C H H N C H C C C C H C H C H H
charge: 0.168770 0.096447 0.168809 0.169004 -0.146773 -0.145309 -0.358081 -0.452452 -0.464448 -0.337810 -0.239718 0.155837 -0.878094 0.295069 0.071617 -0.589492 0.082332 -0.642450 -0.640018 -0.640684 -0.151144 -0.141004 -0.358278 -0.452226 -0.464276 -0.339405 -0.236375 0.155012 -0.879127 0.294385 0.067084 -0.589920 0.088434 -0.158158 -0.136231 -0.337564 -0.463009 -0.453967 -0.361805 -0.239535 0.155037 -0.880449 0.297855 0.062715 -0.583790 0.082629 0.204552 0.174894 0.175763 0.216225 0.195895 0.195864 0.216481 0.225553 0.204405 0.225166 0.177546 0.213942 0.222897 0.209011 0.206684 0.205142 0.231578 0.205316 0.231257 0.205145 0.231480 0.204560 0.175086 0.175883 0.216227 0.195931 0.195866 0.216343 0.225393 0.204389 0.225191 0.177373 0.213782 0.222868 0.208961 0.206469 0.204439 0.175858 0.175322 0.216395 0.195866 0.195901 0.216276 0.225110 0.204558 0.225619 0.177549 0.213512 0.222886 0.208941 0.206614 0.487951 -1.442419 -1.433053 -1.441157 0.253985 0.212532 0.253838 0.212317 0.253652 0.212661 0.175766 -0.461370 0.175815 0.464683 -0.182837 0.141683 0.670869 0.219680 -0.626692 0.222950 -0.452405 0.208597 0.202708 0.175029 -0.454624 0.175493 0.463932 -0.196150 0.146015 0.675018 0.219475 -0.626432 0.222870 -0.451700 0.208603 0.202648 0.175075 -0.454209 0.175774 0.466121 -0.198170 0.150661 0.671220 0.219617 -0.625900 0.222890 -0.457729 0.208540 0.202768
chargesum: -0.00000
title: Mulliken charges with hydrogens summed into heavy atoms:
elementType: N N N N C C C C C C C C C C C C C C C C C C C C C C C C C C C C C C C C C C C C C C C C C C N C C C N C C C C C C C N C C C C C C C N C C C C C C C
charge: 0.168770 0.096447 0.168809 0.169004 0.028990 0.029585 0.071638 -0.040332 -0.052103 0.092147 -0.062171 0.155837 -0.664152 0.517966 0.071617 -0.380481 0.289016 -0.205730 -0.203446 -0.204059 0.024738 0.034083 0.071474 -0.040069 -0.052067 0.090377 -0.059002 0.155012 -0.665345 0.517253 0.067084 -0.380959 0.294903 0.017164 0.039627 0.092493 -0.050748 -0.041789 0.067864 -0.061986 0.155037 -0.666937 0.520741 0.062715 -0.374849 0.289243 0.487951 -0.975901 -0.966897 -0.974844 0.175766 -0.285556 0.464683 0.036843 0.364632 0.670869 -0.418095 -0.249697 0.175029 -0.279131 0.463932 0.023326 0.368886 0.675018 -0.417829 -0.249052 0.175075 -0.278435 0.466121 0.021447 0.373550 0.671220 -0.417359 -0.254961
polarizability: 1.39061653e+03 -1.13337458e-01 1.00556979e+03 -2.31318165e-01 -3.77959705e-01 1.00538861e+03
1716.lowfreq: -2.6749 -0.0007 -0.0002 0.0006 2.5062 4.2279 10.9283 11.9038 12.6941
temp: 298.150 k
press: 1.00000 atm
elementType: 7 7 7 7 6 6 6 6 6 6 6 6 6 6 6 6 6 6 6 6 6 6 6 6 6 6 6 6 6 6 6 6 6 6 6 6 6 6 6 6 6 6 6 6 6 6 1 1 1 1 1 1 1 1 1 1 1 1 1 1 1 1 1 1 1 1 1 1 1 1 1 1 1 1 1 1 1 1 1 1 1 1 1 1 1 1 1 1 1 1 1 1 1 1 1 1 1 7 6 6 6 1 1 1 1 1 1 7 6 1 6 6 6 6 1 6 1 6 1 1 7 6 1 6 6 6 6 1 6 1 6 1 1 7 6 1 6 6 6 6 1 6 1 6 1 1
symmnumber: 1
zpe: 3286643.2 jmol-1
zpe.correction: 1.251816 hartree
zpe.thermalcorrener: 1.315507 hartree
zpe.thermalcorrenthalpy: 1.316452 hartree
zpe.thermalcorrgfe: 1.148115 hartree
zpe.sumelectzpe: -2995.292821 hartree
zpe.sumelectthermal: -2995.229130 hartree
zpe.sumelectthermalent: -2995.228185 hartree
zpe.sumelectthermalfe: -2995.396522 hartree
dipole: -0.1394 0.0145 0.0288
dipole: 0.1431
quadrupole: -353.5012 -468.8397 -468.7271
quadrupole: 0.0847 -0.0603 0.1810
quadrupole: 76.8548 -38.4837 -38.3711 0.0847 -0.0603 0.1810
hfenergy: -2996.544637 hartree
pointgroup: C01 [X(C66H72N8)]
dipole: -0.05486 0.0056948 0.0113356 debye
polarizability: 1390.6165348|-0.1133375|1005.5697944|-0.2313182|-0.3779597|1005.3886133 unknown
InChI: InChI=1S/C66H72N8/c1-2-26-62-61(25-1)67-37-49-13-7-19-55(31-49)43-73-45-57-21-9-15-51(33-57)39-69-63-27-3-5-29-65(63)71-41-53-17-11-23-59(35-53)47-74(44-56-20-8-14-50(32-56)38-68-62)48-60-24-12-18-54(36-60)42-72-66-30-6-4-28-64(66)70-40-52-16-10-22-58(34-52)46-73/h7-24,31-42,61-66H,1-6,25-30,43-48H2
charge 0 multiplicity 1
146 atoms
N  1.82713094 -2.97386608 -4.13616116
N  6.21655581 0.0001865 0.00164699
N  1.83359918 -2.10981158 4.64920852
N  1.81576868 5.06862453 -0.51150221
C  0.51264379 -3.57194333 -3.92184915
C  -0.58389863 -2.55954055 -4.37512716
C  -0.57934278 -2.37655486 -5.90771777
C  -0.68048332 -3.70792657 -6.66880706
C  0.41722334 -4.68997915 -6.23080855
C  0.41117491 -4.89650487 -4.70791379
C  2.56287147 -2.75000326 -3.11729091
C  3.92617787 -2.19048624 -3.20343091
C  4.62675795 -1.92964624 -2.01685682
C  4.55504966 -1.94282924 -4.4389479
C  5.94044751 -1.43742159 -2.03422275
C  5.85870798 -1.45742062 -4.46912641
C  6.55023039 -1.21099782 -3.27404039
C  6.6773655 -0.03430417 1.40435428
C  6.67029832 1.23533904 -0.66910557
C  6.6791967 -1.19482703 -0.73237848
C  0.51924967 -1.62858126 5.06453384
C  -0.57838647 -2.51668108 4.40185617
C  -0.57999121 -3.94252618 4.99330479
C  -0.68286924 -3.95404843 6.52671002
C  0.41712801 -3.09490502 7.16945427
C  0.41618302 -1.66575115 6.60419019
C  2.56705017 -1.33336869 3.95008029
C  3.93043397 -1.68289328 3.50491401
C  4.62776592 -0.78360341 2.68526112
C  4.5628249 -2.87525644 3.90702444
C  5.94172009 -1.04163279 2.26632706
C  5.86705912 -3.14036296 3.50133718
C  6.55556149 -2.22623967 2.6905799
C  -0.59492079 5.09529928 -0.03385025
C  0.50254986 5.18239299 -1.13879987
C  0.4128248 6.51374121 -1.91504007
C  0.42852701 7.74474564 -0.99512979
C  -0.67109556 7.66001789 0.07493725
C  -0.58251145 6.34702377 0.86901364
C  2.54692463 4.06809279 -0.81782297
C  3.90988734 3.86370957 -0.28896156
C  4.61457682 2.70955253 -0.66018579
C  4.53504285 4.8082453 0.54802754
C  5.92848915 2.48073977 -0.22466583
C  5.83886511 4.59399063 0.98402167
C  6.53465908 3.43982094 0.59548873
H  -1.40588285 -1.70964208 -6.18619397
H  -0.36204044 -1.589794 -3.89700154
H  0.35254118 -3.77844274 -2.84970553
H  -1.66608126 -4.15800409 -6.49002106
H  -0.60911597 -3.5182366 -7.7483413
H  0.27994194 -5.65792887 -6.7315377
H  1.39730744 -4.30649715 -6.54444064
H  -0.52011325 -5.39388228 -4.40798797
H  1.23853704 -5.5513649 -4.40444201
H  0.3528527 -1.86605973 -6.18190915
H  2.214227 -2.98090268 -2.09726967
H  4.14342589 -2.12280718 -1.06044508
H  4.01761294 -2.14777578 -5.35989089
H  6.34792135 -1.27486091 -5.42292743
H  7.57446728 -0.84534996 -3.30965754
H  7.76527678 -0.22939004 1.45303875
H  6.51451406 0.96361443 1.82203115
H  7.75776234 1.38016255 -0.5263522
H  6.50555468 1.09904489 -1.74194464
H  7.76645477 -1.13601979 -0.92836777
H  6.52045645 -2.05715077 -0.07813236
H  -1.40809144 -4.50873198 4.54703412
H  -0.35384517 -2.57639622 3.3229168
H  0.36237091 -0.59228184 4.71928656
H  -1.66761469 -3.57484081 6.83089287
H  -0.61498877 -4.98845348 6.8898512
H  0.2791681 -3.05734972 8.25851533
H  1.39575748 -3.55948783 6.98934921
H  -0.51353938 -1.15761707 6.89051682
H  1.24509077 -1.08340913 7.02758144
H  0.3505969 -4.43530481 4.68360927
H  2.21535468 -0.33306423 3.64816491
H  4.14220319 0.13994778 2.3740401
H  4.0271331 -3.5717962 4.54478121
H  6.35911736 -4.05618655 3.81995165
H  7.58053844 -2.43636757 2.39188921
H  1.24141996 6.55926814 -2.63396238
H  0.3375109 4.34663153 -1.84011573
H  -0.37819492 4.20599214 0.5824527
H  1.40883337 7.8250822 -0.506641
H  0.29920474 8.65350416 -1.59840718
H  -0.59234719 8.51039026 0.76571699
H  -1.65567849 7.73256022 -0.40614896
H  0.34864119 6.33129259 1.44989008
H  -1.41076547 6.27362775 1.58602274
H  -0.51778578 6.50111532 -2.49684836
H  2.1938631 3.2954386 -1.52055022
H  4.1354908 1.97876958 -1.30944567
H  3.99430885 5.70504398 0.83483669
H  6.32466003 5.32751182 1.62301545
H  7.55892729 3.29002965 0.93085866
N  -6.01956095 0.00260255 0.00920144
C  -6.47241959 -1.39089445 -0.08588659
C  -6.47499655 0.78055317 -1.14979807
C  -6.47461042 0.61564772 1.26352383
H  -6.27832067 -1.86580951 0.88289432
H  -7.56846731 -1.43935121 -0.23511755
H  -6.27745484 0.18011568 -2.04550432
H  -7.57164561 0.92963955 -1.11831631
H  -6.28483605 1.69277568 1.1900774
H  -7.57013071 0.50634366 1.38076322
N  -1.8983476 4.96323594 -0.6769829
C  -2.56227546 3.88985333 -0.48633853
H  -2.16279071 3.07320303 0.13758879
C  -3.90233 3.65029372 -1.05794485
C  -4.51858958 2.40682663 -0.83918862
C  -4.58239943 4.63535096 -1.79545117
C  -5.80244248 2.13254432 -1.32774415
H  -3.99298011 1.64592084 -0.26796793
C  -5.85885462 4.37224312 -2.28687023
H  -4.10910699 5.59766671 -1.96464954
C  -6.46804392 3.13479317 -2.04762651
H  -6.39128274 5.13533236 -2.84958519
H  -7.47189708 2.94746016 -2.42434245
N  -1.88672298 -3.0555683 -3.94229106
C  -2.54911848 -2.3626715 -3.09940187
H  -2.14769744 -1.4191205 -2.69462751
C  -3.88922486 -2.74099061 -2.60881437
C  -4.51015645 -1.93109086 -1.64307213
C  -4.56511093 -3.87404105 -3.09455341
C  -5.7945125 -2.22035557 -1.1647417
H  -3.98858288 -1.05389373 -1.26864722
C  -5.84163347 -4.17193808 -2.62363481
H  -4.0878778 -4.50009424 -3.84215829
C  -6.45542061 -3.34739963 -1.67332511
H  -6.37045008 -5.04287132 -3.00342406
H  -7.45916141 -3.58308376 -1.32463757
N  -1.87986675 -1.89255012 4.61914956
C  -2.54222971 -1.499972 3.60111532
H  -2.14243372 -1.61275235 2.57979232
C  -3.88239718 -0.88681681 3.68905307
C  -4.50697716 -0.45602814 2.50665493
C  -4.55576361 -0.74317496 4.91486623
C  -5.79309248 0.09871462 2.5205959
H  -3.9868812 -0.56914126 1.55896867
C  -5.83380877 -0.1898009 4.94019189
H  -4.07610073 -1.07679039 5.82994882
C  -6.45172279 0.21924393 3.7524639
H  -6.36079141 -0.08479999 5.88553646
H  -7.45685466 0.63564101 3.78450321
