program: Gaussian 16
title: First fragment in Amendola Capsule
version: ES64L-G16RevC.02
basis: 6-31+G(d)
method: RB3LYP
operation: Freq
keyword: #p
keyword: b3lyp/6-31+G(d)
keyword: Nosymm
keyword: Freq
keyword: SCRF=(SMD,solvent=chloroform)
keyword: geom=checkpoint
keyword: guess=read
title: #p b3lyp/6-31+G(d) Nosymm Freq SCRF=(SMD,solvent=chloroform) geom=chec
basis: NPDir=0 NMtPBC= 1 NCelOv= 1 NCel= 1 NClECP= 1 NCelD= 1
basis: NCelK= 1 NCelE2= 1 NClLst= 1 CellRange= 0.0.
basis: One-electron integrals computed using PRISM.
basis: NBasis= 1550 RedAO= T EigKep= 1.08D-06 NBF= 1550
basis: NBsUse= 1528 1.00D-06 EigRej= 9.51D-07 NBFU= 1528
converged: YES YES NO YES
title: Mulliken charges:
elementType: N N N C C C C C C C C C C C C C C C C C C C C C C C C C C C C C C C C C C C C H H H H H H H H H H H H H H H H H H H H H H H H H H H H H H H H H H H H H H H H H N N N C C C C H H C C H H H H H H H H N N C C C C C C C C C C C C C C C C C C C C C C C C H H H H H H H H H H H H H H H H H H H H H
charge: 0.346961 0.349245 0.441556 -0.292358 -0.100921 -0.149074 -0.501321 -0.469930 -0.491433 -0.471303 -0.291615 -0.130620 -0.118136 -0.480984 -0.484525 -0.476926 -0.490955 -0.294469 -1.582553 -1.573164 -1.587191 1.028175 -0.098576 -0.461777 0.759233 -0.526757 -0.796474 1.026298 -0.097632 -0.459186 0.765574 -0.527546 -0.798931 1.040132 -0.102088 -0.465903 0.762228 -0.523698 -0.799430 0.177705 0.200783 0.236117 0.236449 0.213147 0.199792 0.200026 0.212888 0.228931 0.200855 0.228506 0.178058 0.200960 0.236136 0.235917 0.213050 0.199867 0.199835 0.213110 0.228500 0.200837 0.228742 0.178259 0.202511 0.249934 0.202300 0.249951 0.202518 0.250024 0.248965 0.198720 0.203629 0.204244 0.249080 0.198676 0.203638 0.204034 0.249129 0.198660 0.203658 0.204207 0.349859 0.349520 0.347050 -0.126479 -0.121142 -0.488033 -0.479150 0.199868 0.213098 -0.480829 -0.487402 0.200913 0.236465 0.236163 0.199956 0.212965 0.228749 0.200942 0.228675 0.346464 0.439256 -0.286609 -0.296298 -0.296255 -1.577191 -1.569639 -1.576774 1.027319 -0.104253 -0.457795 0.757661 -0.529345 -0.797286 1.029065 -0.103880 -0.458986 0.760062 -0.529618 -0.800083 1.035834 -0.103770 -0.464102 0.763139 -0.531025 -0.800364 0.177933 0.178204 0.177425 0.202328 0.249742 0.202016 0.249904 0.202295 0.250028 0.248768 0.198666 0.203690 0.204311 0.249791 0.198663 0.203639 0.204233 0.248762 0.198706 0.203681 0.204226
chargesum: -0.00000
title: Mulliken charges with hydrogens summed into heavy atoms:
elementType: N N N C C C C C C C C C C C C C C C C C C C C C C C C C C C C C C C C C C C C N N N C C C C C C N N C C C C C C C C C C C C C C C C C C C C C C C C
charge: 0.346961 0.349245 0.441556 -0.114654 0.135528 0.087043 -0.072031 -0.056992 -0.078519 -0.041517 -0.113557 0.105297 0.118000 -0.051283 -0.071608 -0.063982 -0.061617 -0.116209 -1.130108 -1.120912 -1.134649 1.028175 0.150390 -0.263057 0.759233 -0.323128 -0.592230 1.026298 0.151448 -0.260510 0.765574 -0.323908 -0.594898 1.040132 0.147041 -0.267242 0.762228 -0.320041 -0.595223 0.349859 0.349520 0.347050 0.109683 0.115323 -0.058445 -0.066184 -0.067908 -0.057710 0.346464 0.439256 -0.108676 -0.118094 -0.118830 -1.125121 -1.117720 -1.124451 1.027319 0.144515 -0.259129 0.757661 -0.325655 -0.592975 1.029065 0.145911 -0.260322 0.760062 -0.325980 -0.595850 1.035834 0.144992 -0.265396 0.763139 -0.327344 -0.596138
chargesum: 0.00000
polarizability: 1.33281803e+03 7.73988851e+01 1.00064464e+03 8.21765369e+01 1.79258177e+01 1.00275500e+03
1716.lowfreq: -0.3597 -0.0002 0.0007 0.0008 2.2488 3.8255 13.4300 15.3665 16.4287
temp: 298.150 k
press: 1.00000 atm
elementType: 7 7 7 6 6 6 6 6 6 6 6 6 6 6 6 6 6 6 6 6 6 6 6 6 6 6 6 6 6 6 6 6 6 6 6 6 6 6 6 1 1 1 1 1 1 1 1 1 1 1 1 1 1 1 1 1 1 1 1 1 1 1 1 1 1 1 1 1 1 1 1 1 1 1 1 1 1 1 1 1 7 7 7 6 6 6 6 1 1 6 6 1 1 1 1 1 1 1 1 7 7 6 6 6 6 6 6 6 6 6 6 6 6 6 6 6 6 6 6 6 6 6 6 6 6 1 1 1 1 1 1 1 1 1 1 1 1 1 1 1 1 1 1 1 1 1
symmnumber: 1
zpe: 3284641.2 jmol-1
zpe.correction: 1.251054 hartree
zpe.thermalcorrener: 1.314725 hartree
zpe.thermalcorrenthalpy: 1.315669 hartree
zpe.thermalcorrgfe: 1.148493 hartree
zpe.sumelectzpe: -2995.258680 hartree
zpe.sumelectthermal: -2995.195009 hartree
zpe.sumelectthermalent: -2995.194064 hartree
zpe.sumelectthermalfe: -2995.361241 hartree
dipole: -0.0219 -0.0157 0.0078
dipole: 0.0280
quadrupole: -381.0644 -406.8342 -406.7666
quadrupole: 6.0234 6.3912 1.3150
quadrupole: 17.1573 -8.6125 -8.5449 6.0234 6.3912 1.3150
hfenergy: -2996.5097339 hartree
pointgroup: C01 [X(C66H72N8)]
dipole: -0.0086073 -0.006173 0.0030555 debye
polarizability: 1332.8180305|77.3988851|1000.6446436|82.1765369|17.9258177|1002.7550039 unknown
InChI: InChI=1S/C66H72N8/c1-2-26-62-61(25-1)67-37-49-13-7-19-55(31-49)43-73-45-57-21-9-15-51(33-57)39-69-63-27-3-5-29-65(63)71-41-53-17-11-23-59(35-53)47-74(44-56-20-8-14-50(32-56)38-68-62)48-60-24-12-18-54(36-60)42-72-66-30-6-4-28-64(66)70-40-52-16-10-22-58(34-52)46-73/h7-24,31-42,61-66H,1-6,25-30,43-48H2
charge 0 multiplicity 1
146 atoms
N  -3.69695354 -1.38075613 -2.21947125
N  -4.06351928 -4.35743238 2.10575873
N  -0.31191593 -0.75214448 1.69631891
C  -4.82505736 1.97086303 2.29527707
C  -5.06814099 -1.31872688 -2.74147168
C  -5.70730374 0.00896861 -2.24722486
C  -5.19566957 1.20303988 -3.078735
C  -5.40224706 1.01974689 -4.59228043
C  -4.77433613 -0.29476455 -5.08318238
C  -5.27722404 -1.49300751 -4.25946116
C  -2.73773701 -1.89510771 -2.88290151
C  -5.10675741 -5.189872 0.05747081
C  -5.27765881 -5.00459359 1.5912635
C  -5.73630129 -6.32061548 2.25215371
C  -4.8145365 -7.5113699 1.93674518
C  -4.64294555 -7.69416263 0.42010914
C  -4.18364944 -6.38690572 -0.24867046
C  -3.58214239 -4.63160841 3.25383567
C  0.54364429 -1.70875307 0.98548
C  -0.1571363 -0.88510426 3.14914189
C  -0.04203954 0.62211898 1.25957276
C  -0.72538668 -2.16455008 3.7428828
C  -1.85115763 -2.79494749 3.20558327
C  -0.14210864 -2.69821091 4.90558732
C  -2.40019124 -3.93887945 3.81226463
C  -0.68723695 -3.82325862 5.52792043
C  -1.8168658 -4.44098586 4.98675497
C  0.22015718 -1.89223766 -0.48880361
C  -1.0828203 -1.78032085 -0.98140773
C  1.25016938 -2.25033527 -1.37639203
C  -1.36887813 -2.02415 -2.33672209
C  0.97716929 -2.51318206 -2.7204746
C  -0.3300155 -2.40605889 -3.20069517
C  -1.08435069 1.64797798 1.67589227
C  -2.43609482 1.31961282 1.80947358
C  -0.69042026 2.98332691 1.87236615
C  -3.3921986 2.30000721 2.13004375
C  -1.63173932 3.9701681 2.17278907
C  -2.98126791 3.63228705 2.29689787
H  -5.48584182 2.84478124 2.37601238
H  -5.64671975 2.14168634 -2.73243308
H  -5.36933948 0.13308018 -1.20953551
H  -5.60770876 -2.12043309 -2.21921796
H  -6.474987 1.0166156 -4.83031885
H  -4.9651818 1.87193385 -5.13018953
H  -5.00837884 -0.45272826 -6.14473401
H  -3.68046043 -0.2184472 -5.01246989
H  -6.35808259 -1.60934296 -4.41897065
H  -4.82271608 -2.42823644 -4.61040231
H  -4.12050923 1.29581915 -2.87214179
H  -2.85648303 -2.27608669 -3.90644369
H  -5.85437301 -6.19260586 3.33569247
H  -6.07236927 -4.25625657 1.71253618
H  -4.62059661 -4.27201706 -0.29967633
H  -3.82721828 -7.35772695 2.39379546
H  -5.22709008 -8.42595571 2.38391461
H  -3.91356672 -8.48949633 0.21498136
H  -5.59709459 -8.02617762 -0.01193627
H  -3.18614687 -6.12257338 0.12867933
H  -4.06582423 -6.52113625 -1.33148586
H  -6.7427891 -6.53443639 1.86684479
H  -4.00820156 -5.40245573 3.9102591
H  1.61274101 -1.43597883 1.08702707
H  0.42894292 -2.67956549 1.4820491
H  0.90711201 -0.79443218 3.44401454
H  -0.67435598 -0.03584032 3.61118307
H  0.95355063 0.96091629 1.60860284
H  0.00708582 0.61168705 0.16418559
H  -2.31377451 -2.40126275 2.30671674
H  0.74126274 -2.22329572 5.32873563
H  -0.22856801 -4.22056585 6.43026537
H  -2.24292503 -5.31966921 5.4671264
H  -1.89175068 -1.50237778 -0.314015
H  2.27125151 -2.33049222 -1.00784646
H  1.78341489 -2.79602906 -3.39308167
H  -0.54645319 -2.60751812 -4.2480781
H  -2.76038229 0.29430118 1.66641329
H  0.36096223 3.2505435 1.78221227
H  -1.31251304 4.99987128 2.31519429
H  -3.71748293 4.39777549 2.53451966
N  -6.444075 -5.17434993 -0.54954541
N  -7.15857492 -0.19755015 -2.15481052
N  -5.25455746 0.77163085 2.34309165
C  -6.83258395 -0.82290561 3.31319946
C  -6.685595 0.45597722 2.44221816
C  -7.63976943 1.56309162 2.93478782
C  -7.46834288 1.88946789 4.4285351
H  -8.21278528 2.63863886 4.73043715
H  -6.48190733 2.33946428 4.60697182
C  -7.60849546 0.62573469 5.29257917
C  -6.6620262 -0.48658527 4.80864542
H  -7.53748789 2.46744111 2.32166672
H  -6.98454088 0.16051726 1.42744215
H  -6.01251333 -1.48678375 3.00753455
H  -7.39446458 0.86052961 6.34408532
H  -8.6506189 0.27954553 5.25556946
H  -5.62278514 -0.15599687 4.94233686
H  -6.76867867 -1.38798378 5.42537475
H  -8.66251035 1.20078559 2.76181479
N  -8.05895101 -1.51365992 2.89428865
N  -11.24800324 -3.17801623 -0.87552149
C  -8.80545421 -2.13655343 3.71872149
C  -6.7422303 -5.8943477 -1.55826009
C  -7.99514478 0.72989587 -2.40928758
C  -11.28247717 -3.72755869 -2.23536004
C  -12.00858203 -1.92611786 -0.79190844
C  -11.73550282 -4.15811851 0.101362
C  -11.3893495 -0.7447867 -1.52209528
C  -10.00555762 -0.58408194 -1.63507124
C  -12.23062191 0.25158557 -2.04788187
C  -9.45600132 0.55052019 -2.25860469
C  -11.69807876 1.39232226 -2.65229367
C  -10.31367848 1.54564628 -2.75450859
C  -10.26760956 -4.82540729 -2.51260649
C  -9.01492208 -4.85024175 -1.89347882
C  -10.5698271 -5.81241995 -3.46736515
C  -8.06669151 -5.83800099 -2.21519035
C  -9.63105076 -6.78811665 -3.80931721
C  -8.37977494 -6.80011563 -3.1888667
C  -11.44201219 -3.82198355 1.55484425
C  -10.29145024 -3.12771227 1.93827544
C  -12.32101974 -4.27698132 2.55350584
C  -10.00775622 -2.88707128 3.29454255
C  -12.04217538 -4.06113384 3.90478719
C  -10.88591861 -3.37173799 4.27717862
H  -8.61256888 -2.15807153 4.80002971
H  -6.04019301 -6.6089878 -2.00922754
H  -7.69315988 1.72528885 -2.76255259
H  -12.2944823 -4.10303175 -2.48540712
H  -11.08600795 -2.89949468 -2.92665993
H  -13.04575779 -2.06733441 -1.15518421
H  -12.09081619 -1.66570418 0.26999071
H  -12.82468971 -4.32521494 -0.01443077
H  -11.25451944 -5.11577564 -0.1306612
H  -9.33772897 -1.34223006 -1.23980469
H  -13.31027268 0.13333762 -1.976357
H  -12.36185498 2.15715883 -3.04840574
H  -9.89483206 2.4308446 -3.2292429
H  -8.76319217 -4.09973904 -1.15149121
H  -11.54563802 -5.81064162 -3.94965119
H  -9.87702558 -7.54120779 -4.55414368
H  -7.64732655 -7.56164129 -3.44948253
H  -9.60115051 -2.76411363 1.18454586
H  -13.22608979 -4.81004003 2.2678954
H  -12.72848281 -4.42511897 4.66568296
H  -10.66776137 -3.19763511 5.32913083
