program: Gaussian 16
title: First fragment in Amendola Capsule
version: ES64L-G16RevC.02
method: RB3LYP
basis: 6-31+G(d)
operation: Freq
keyword: #P
keyword: Geom=AllCheck
keyword: Guess=TCheck
keyword: SCRF=Check
keyword: GenChk
keyword: RB3LYP/6-31+G(d)
keyword: Freq
converged: YES YES NO YES
title: Mulliken charges:
elementType: N N C C C C C C C C C C C C C C H H H H H H H H H H H H H H H H N C H H C H H C H H N N C C C C C C C C C C C C C C H H H H H H H H H H H H H H H H N N C C C C C C C C C C C C C C H H H H H H H H H H H H H H H H N C C C C C C C C C C C C C C C C C C C C C H H H H H H H H H H H H H H H H H H C H Cl Cl Cl
charge: 0.259240 0.161532 -0.004267 -0.408201 -0.267585 -0.645683 -0.440982 -0.321414 -0.294671 -0.336243 0.124383 -0.847580 0.429212 0.353652 -0.489510 -0.087999 0.202567 0.190342 0.182028 0.214670 0.199243 0.197337 0.214303 0.226693 0.204724 0.231797 0.179268 0.180317 0.210656 0.222717 0.208547 0.203833 0.177474 -0.936106 0.203153 0.241908 -0.929205 0.202938 0.241739 -0.915394 0.203032 0.241285 0.254262 0.156948 -0.002413 -0.418626 -0.254694 -0.658586 -0.439744 -0.309738 -0.280227 -0.330114 0.139451 -0.861678 0.424992 0.364542 -0.485826 -0.099349 0.202775 0.189159 0.181219 0.214791 0.199401 0.197386 0.214559 0.226377 0.204897 0.231946 0.178586 0.180475 0.210796 0.222539 0.208566 0.203834 0.160871 0.257736 -0.413704 -0.004736 -0.320575 -0.442239 -0.642548 -0.269040 -0.334566 -0.302783 0.129341 -0.821794 0.422468 0.375003 -0.494594 -0.094168 0.204777 0.181923 0.189574 0.214246 0.197325 0.199171 0.214560 0.231862 0.202527 0.226524 0.180628 0.178703 0.210694 0.222631 0.208678 0.203819 0.134845 -0.542851 -0.553212 -0.543652 0.018883 -0.298830 -0.200373 0.317479 -0.282420 -0.391498 0.008326 -0.318896 -0.197189 0.317912 -0.276659 -0.377435 0.007175 -0.318820 -0.201761 0.325365 -0.277416 -0.375956 0.229596 0.201366 0.229536 0.201229 0.229622 0.201110 0.226465 0.208090 0.205096 0.206760 0.226714 0.208126 0.205084 0.206599 0.226784 0.207911 0.204960 0.206623 -0.492351 0.374323 0.060668 0.070275 0.059831
chargesum: -0.00000
title: Mulliken charges with hydrogens summed into heavy atoms:
elementType: N N C C C C C C C C C C C C C C N C C C N N C C C C C C C C C C C C C C N N C C C C C C C C C C C C C C N C C C C C C C C C C C C C C C C C C C C C C Cl Cl Cl
charge: 0.259240 0.161532 0.177760 -0.217859 0.166778 -0.231770 -0.029342 0.110003 -0.115404 -0.155925 0.124383 -0.636924 0.651929 0.353652 -0.280963 0.115834 0.177474 -0.491045 -0.484528 -0.471078 0.254262 0.156948 0.178806 -0.229467 0.180026 -0.244394 -0.027798 0.121535 -0.101641 -0.149640 0.139451 -0.650882 0.647531 0.364542 -0.277261 0.104485 0.160871 0.257736 -0.224130 0.177187 0.110726 -0.030669 -0.228817 0.165350 -0.153938 -0.124081 0.129341 -0.611100 0.645099 0.375003 -0.285916 0.109651 0.134845 -0.111888 -0.122447 -0.112920 0.018883 -0.072365 0.007717 0.317479 -0.077325 -0.184738 0.008326 -0.092182 0.010937 0.317912 -0.071575 -0.170837 0.007175 -0.092036 0.006150 0.325365 -0.072456 -0.169333 -0.118029 0.060668 0.070275 0.059831
chargesum: 0.00000
polarizability: 1.38504428e+03 6.01668828e+01 1.07719472e+03 6.92197641e+01 1.27449801e+01 1.07975075e+03
1716.lowfreq: -6.2427 -3.1420 -0.0013 0.0005 0.0013 3.1734 11.8251 12.2184 13.2998
temp: 298.150 k
press: 1.00000 atm
elementType: 7 7 6 6 6 6 6 6 6 6 6 6 6 6 6 6 1 1 1 1 1 1 1 1 1 1 1 1 1 1 1 1 7 6 1 1 6 1 1 6 1 1 7 7 6 6 6 6 6 6 6 6 6 6 6 6 6 6 1 1 1 1 1 1 1 1 1 1 1 1 1 1 1 1 7 7 6 6 6 6 6 6 6 6 6 6 6 6 6 6 1 1 1 1 1 1 1 1 1 1 1 1 1 1 1 1 7 6 6 6 6 6 6 6 6 6 6 6 6 6 6 6 6 6 6 6 6 6 1 1 1 1 1 1 1 1 1 1 1 1 1 1 1 1 1 1 6 1 17 17 17
symmnumber: 1
zpe: 3341448.2 jmol-1
zpe.correction: 1.272690 hartree
zpe.thermalcorrener: 1.343185 hartree
zpe.thermalcorrenthalpy: 1.344129 hartree
zpe.thermalcorrgfe: 1.158862 hartree
zpe.sumelectzpe: -4414.546256 hartree
zpe.sumelectthermal: -4414.475761 hartree
zpe.sumelectthermalent: -4414.474817 hartree
zpe.sumelectthermalfe: -4414.660084 hartree
dipole: -2.4043 -0.5148 -0.5300
dipole: 2.5153
quadrupole: -386.1339 -488.8102 -490.2587
quadrupole: 23.0835 19.6496 4.2289
quadrupole: 68.9337 -33.7426 -35.1911 23.0835 19.6496 4.2289
hfenergy: -4415.8189463 hartree
pointgroup: C01 [X(C67H73Cl3N8)]
dipole: -0.9459199 -0.2025439 -0.2085012 debye
polarizability: 1385.0442806|60.1668828|1077.194717|69.2197641|12.7449801|1079.7507536 unknown
InChI: InChI=1S/C66H72N8.CHCl3/c1-2-26-62-61(25-1)67-37-49-13-7-19-55(31-49)43-73-45-57-21-9-15-51(33-57)39-69-63-27-3-5-29-65(63)71-41-53-17-11-23-59(35-53)47-74(44-56-20-8-14-50(32-56)38-68-62)48-60-24-12-18-54(36-60)42-72-66-30-6-4-28-64(66)70-40-52-16-10-22-58(34-52)46-73;2-1(3)4/h7-24,31-42,61-66H,1-6,25-30,43-48H2;1H
charge 0 multiplicity 1
151 atoms
N  -9.09529732 0.9580435 3.16209048
N  -5.59088701 2.12548095 2.94138232
C  -7.04413202 2.31774895 3.03300855
C  -7.66919 0.97222971 3.50006954
C  -7.45815709 0.73008443 5.01094756
C  -7.8664594 1.9172984 5.89356975
C  -7.13594441 3.19457864 5.45549391
C  -7.40421982 3.4888649 3.97335855
C  -9.51022499 -0.04272831 2.48521907
C  -4.99097777 2.68465627 1.96347808
C  -10.90065127 -0.24413259 2.03672084
C  -11.20542091 -1.42465148 1.34182894
C  -11.9215169 0.69550144 2.27306825
C  -12.50048139 -1.690586 0.87472819
C  -13.21139323 0.44333276 1.81451152
C  -13.49951963 -0.74017039 1.11856204
H  -8.00332339 -0.17794258 5.30030682
H  -7.15032926 0.1680869 2.95785369
H  -7.45047529 2.55043565 2.03543916
H  -8.95211538 2.0762117 5.83022026
H  -7.63943555 1.68809742 6.94341941
H  -7.46123963 4.04954138 6.06331872
H  -6.05645222 3.07589977 5.62441632
H  -8.47344886 3.70150888 3.83865033
H  -6.85735378 4.3830839 3.64637754
H  -6.39019269 0.52310995 5.16082287
H  -8.81677964 -0.84463215 2.18627646
H  -5.53999309 3.31959996 1.24794319
H  -10.41757149 -2.15464788 1.16697602
H  -11.69129614 1.6106639 2.81064129
H  -14.00155894 1.16869027 1.99276397
H  -14.51200012 -0.92370386 0.76454105
N  -12.03028612 -3.22562241 -1.06014524
C  -12.14783584 -4.6284113 -1.50145322
H  -13.20998201 -4.92216854 -1.59830858
H  -11.71344275 -4.68678224 -2.50555271
C  -12.4529205 -2.30361462 -2.13141735
H  -13.46356636 -2.56404861 -2.49852527
H  -12.52869212 -1.30574311 -1.68554929
C  -12.81532048 -2.99687198 0.16802922
H  -13.90002796 -3.0433885 -0.04428426
H  -12.59294334 -3.82524297 0.84958553
N  -6.9806046 -1.1019612 -4.78385062
N  -3.38297471 -1.50916268 -4.01266315
C  -4.57290982 -1.63191455 -4.86445086
C  -5.66613763 -0.69089665 -4.28224648
C  -5.39149749 0.79181197 -4.61820633
C  -5.11182197 1.04903864 -6.10517183
C  -3.95307425 0.17140966 -6.59923153
C  -4.24946706 -1.31202637 -6.34032398
C  -7.88430574 -1.31264769 -3.9059458
C  -2.73681998 -2.57939086 -3.75573057
C  -9.26923836 -1.72794284 -4.19655323
C  -10.16144108 -1.84576929 -3.11984291
C  -9.72521303 -2.0076485 -5.49837903
C  -11.49509439 -2.23560926 -3.30748984
C  -11.04654927 -2.39756628 -5.69788216
C  -11.92592033 -2.51224625 -4.61080176
H  -6.24202324 1.39314363 -4.27119204
H  -5.63547739 -0.79711771 -3.18763584
H  -4.95644398 -2.66415385 -4.81991205
H  -6.01201507 0.83494048 -6.69818093
H  -4.87746702 2.11148636 -6.25520815
H  -3.78435769 0.32903097 -7.67297969
H  -3.02673364 0.46345684 -6.08510383
H  -5.11885952 -1.61348323 -6.94025654
H  -3.4080194 -1.94096368 -6.65972063
H  -4.51861701 1.10401406 -4.02967629
H  -7.66470633 -1.18670898 -2.83382586
H  -3.03809477 -3.54479854 -4.19560659
H  -9.81099195 -1.62157666 -2.11433686
H  -9.03931478 -1.91823578 -6.33565291
H  -11.40075921 -2.6176808 -6.70207365
H  -12.95602471 -2.81845076 -4.7815343
N  -4.04070714 -5.86895976 2.84812508
N  -7.14154538 -7.06844066 1.22264947
C  -5.72464687 -6.69946621 1.28786026
C  -5.26864219 -6.67094934 2.77455626
C  -5.05550058 -8.08861597 3.34922086
C  -4.16558662 -8.98141307 2.47383162
C  -4.7213405 -9.06431502 1.04508021
C  -4.86650166 -7.66240508 0.43779652
C  -3.91039684 -5.0945506 3.85407596
C  -7.90744518 -6.27490343 0.57816776
C  -9.35937603 -6.45979017 0.39649919
C  -10.05168836 -5.52306881 -0.38623052
C  -10.06958321 -7.52901173 0.97395765
C  -11.4325816 -5.62501574 -0.60697789
C  -11.44097351 -7.64082981 0.76316943
C  -12.11907833 -6.69540638 -0.02067503
H  -4.64328494 -7.99825001 4.36289612
H  -6.06429978 -6.18573605 3.36263382
H  -5.58550356 -5.68463306 0.88639015
H  -3.14312479 -8.57937899 2.44673342
H  -4.10187695 -9.98358634 2.918616
H  -4.05967804 -9.67085528 0.4121771
H  -5.69741655 -9.5691471 1.06053871
H  -3.87084136 -7.21011643 0.33830252
H  -5.29509103 -7.71621824 -0.57159151
H  -6.04487507 -8.55551293 3.44739781
H  -4.67047749 -5.06637717 4.65271628
H  -7.50190674 -5.36816468 0.10166212
H  -9.50197644 -4.70020285 -0.83896718
H  -9.53921748 -8.25711257 1.58064092
H  -11.99252016 -8.46416104 1.21059301
H  -13.1913176 -6.79517167 -0.1772243
N  -0.72236045 -1.06484966 1.36597386
C  -0.64899311 0.10521532 2.27183626
C  -0.00477753 -0.77960961 0.1016308
C  -0.14273861 -2.25899628 2.02382435
C  -0.22022647 -1.79574743 -1.00598062
C  -1.34041791 -1.70822812 -1.84227272
C  0.71149874 -2.82171245 -1.23674379
C  -1.55470517 -2.64209929 -2.87037966
C  0.50435705 -3.76630816 -2.24599172
C  -0.63449278 -3.68936756 -3.04798392
C  -1.43577296 1.32233994 1.81909311
C  -2.80319411 1.43101111 2.10355493
C  -0.80547988 2.37684264 1.13746254
C  -3.54447526 2.55074103 1.68913596
C  -1.53282682 3.48973044 0.70626217
C  -2.90164613 3.56793724 0.96306688
C  -0.94112511 -2.80143658 3.19577093
C  -2.01579177 -3.67366664 2.98033391
C  -0.60114871 -2.46802141 4.51754219
C  -2.76480882 -4.18233034 4.05509928
C  -1.34635324 -2.95425415 5.59542279
C  -2.43701762 -3.79277948 5.36497424
H  -1.04284258 -0.21416034 3.23933063
H  0.40786782 0.39531087 2.43186223
H  -0.3564569 0.19153332 -0.25393847
H  1.08113834 -0.68008484 0.29628628
H  -0.07753712 -3.0419748 1.26484076
H  0.89126287 -2.04374408 2.35770513
H  -2.06893816 -0.91646312 -1.68895011
H  1.6024521 -2.88546083 -0.61552312
H  1.22838687 -4.56213981 -2.40250809
H  -0.80433019 -4.42869091 -3.82814103
H  -3.30893758 0.63231617 2.63967948
H  0.26227074 2.32208098 0.9358606
H  -1.03254119 4.29107477 0.16812665
H  -3.47378128 4.42782906 0.62046386
H  -2.29014751 -3.95371145 1.96660854
H  0.24928743 -1.81544049 4.70363574
H  -1.07811277 -2.6757666 6.61156387
H  -3.02579907 -4.16596854 6.20051206
C  -6.24110145 -2.12009954 0.20189357
H  -7.27779502 -2.34059148 -0.03562938
Cl -5.20984276 -3.14510794 -0.83772514
Cl -5.98650079 -2.49512599 1.930611
Cl -5.9611151 -0.38483811 -0.12495739
