program: Gaussian 09
title: 000041238
version: EM64L-G09RevD.01
frameworkgroup: C1[X(C21H17NO9S2)]
method: RPBEPBE
basis: SDD
operation: Freq
keyword: #p
keyword: freq=noraman
keyword: PBEPBE/SDD
title: #p freq=noraman PBEPBE/SDD
converged: YES YES NO NO
title: Mulliken charges:
elementType: S S O O O O O O O O O N C C C C C C C C C C C C C C C C C C C C C H H H H H H H H H H H H H H H H H
charge: 1.123162 1.123940 -0.188326 -0.406232 -0.407821 -0.553434 -0.552194 -0.465391 -0.453917 -0.464640 -0.457298 -0.407933 -0.161724 0.236636 0.081338 0.023352 0.463445 0.374667 -0.384226 0.379893 -0.359977 -0.293325 -0.343157 -0.341886 -0.249410 -0.407256 -0.822824 -0.335777 -0.343652 -0.345416 -0.359781 0.288898 0.297516 0.337689 0.253452 0.266343 0.280119 0.249957 0.267016 0.236379 0.238282 0.243534 0.235549 0.235580 0.268498 0.265546 0.264890 0.265993 0.401659 0.402262
chargesum: 0.00000
title: Mulliken charges with hydrogens summed into heavy atoms:
elementType: S S O O O O O O O O O N C C C C C C C C C C C C C C C C C C C C C
charge: 1.123162 1.123940 -0.188326 -0.406232 -0.407821 -0.151775 -0.149932 -0.465391 -0.453917 -0.464640 -0.457298 -0.070244 -0.161724 0.236636 0.081338 0.023352 0.463445 0.374667 -0.130774 0.379893 -0.093634 -0.013205 -0.093201 -0.074870 -0.013031 -0.168973 -0.108161 -0.067280 -0.078106 -0.080526 -0.093788 0.288898 0.297516
polarizability: 5.14820601e+02 1.37756057e+01 5.28664144e+02 3.45000924e+01 -2.81899944e+00 2.76170139e+02
1716.lowfreq: -1.7301 0.0012 0.0014 0.0020 4.4772 4.6080 13.0478 16.3449 19.9129
frequency: 12.9213 16.1594 19.7594 20.7043 25.1534 26.1691 34.1666 49.8796 50.6096 57.7507 66.4638 75.2855 107.4935 113.3061 116.9016 121.2893 126.7972 133.9835 141.5280 151.1598 175.4185 211.0460 216.9780 225.5466 235.9634 243.1656 255.3420 264.2565 275.3089 281.1488 287.5323 293.4861 314.7663 316.7936 327.8398 367.3819 384.9112 395.4162 397.2715 405.2453 410.7584 421.3155 425.3206 441.4030 468.0147 481.9368 529.2770 536.2721 540.4370 544.6473 553.6389 560.2881 579.7569 600.5022 610.6995 620.4596 624.8228 631.8599 641.1337 689.1994 733.6904 741.5115 760.3601 784.9985 812.6959 823.1610 825.1384 830.6610 831.7113 849.2033 850.2839 857.3767 860.8049 872.2069 901.3607 923.9256 928.5201 958.0441 959.4369 964.6570 971.3040 975.1322 976.5404 982.9999 991.2305 998.6731 999.5915 1025.9437 1045.0504 1079.2100 1095.1087 1096.6604 1116.7155 1117.3281 1159.3376 1163.5100 1167.2123 1185.3108 1186.9033 1211.4357 1214.3073 1227.2600 1231.7642 1269.0467 1271.9553 1297.7325 1299.4339 1334.0312 1347.2424 1359.2537 1400.7877 1411.4160 1423.3591 1425.7027 1438.1856 1469.4345 1470.6738 1474.2992 1476.0118 1484.9700 1530.3468 1535.8869 1590.1784 1594.9863 1610.6231 1628.5860 1667.4892 2969.4474 3041.9778 3093.1316 3132.1326 3141.5231 3144.3453 3148.3238 3152.6722 3154.0509 3166.7653 3170.1659 3171.7357 3173.6173 3176.4142 3449.1179 3449.3488 3574.7998
redmass: 13.1328 11.0446 9.4378 8.5661 9.0218 6.7629 7.2390 4.8012 5.5111 7.0621 7.6128 4.2839 6.0842 3.1190 1.3667 7.3085 5.5487 8.0389 8.1521 5.3157 5.0019 4.1540 3.5616 3.0185 4.2679 3.8224 5.3113 7.0938 4.1553 3.0782 3.4764 4.2459 4.3105 4.1097 5.2729 9.2735 9.7825 4.4171 3.4684 3.5135 6.2899 5.5028 5.5777 5.6327 6.4056 5.2703 3.7792 4.9593 4.4864 7.1620 4.9095 4.5546 4.0884 4.3917 1.5498 5.8504 7.1806 5.1263 6.4669 3.9770 4.2535 4.3093 3.3929 1.4757 3.5934 2.2261 2.8886 2.2108 1.3901 5.5688 8.1236 3.0024 3.1309 2.4934 2.7852 1.9151 4.1745 13.7728 14.3197 2.0496 1.4908 1.3781 1.3973 1.3755 1.3694 2.7616 2.6574 2.8756 1.5218 1.7154 1.1786 1.1800 1.3653 1.3687 1.7762 1.5535 1.8998 1.5336 4.3017 3.5656 4.0716 2.4413 2.4811 1.8188 2.6499 1.3424 1.3491 2.2762 4.6736 4.6810 1.4086 2.6861 3.9874 3.9529 2.5806 2.2396 2.2372 1.0597 2.3423 1.4049 6.4280 6.7480 5.8815 5.8880 6.9294 7.2906 10.1492 1.0391 1.0979 1.0967 1.0877 1.0895 1.0911 1.0887 1.0880 1.0889 1.0987 1.0959 1.0966 1.0973 1.0978 1.0654 1.0654 1.0793
irintensity: 0.7800 0.9791 1.3711 0.8042 0.4829 0.3180 3.4253 0.4514 0.7331 6.0688 5.8084 1.5661 4.5315 6.0549 4.5986 14.7222 26.7122 31.0195 3.6183 3.3193 17.2644 4.0763 16.8110 8.8769 76.8458 42.2492 42.5827 35.3671 37.3897 6.7294 14.3935 12.0676 13.3353 16.4642 19.8293 33.6794 60.6752 7.3836 6.7836 7.1403 44.4770 6.2063 24.8278 4.3326 1.0923 30.2046 8.0136 138.9338 95.9537 102.9808 69.7416 41.4354 31.6486 46.8930 145.3363 1.3024 2.3183 16.8312 0.3426 23.2547 4.6255 1.0292 31.7958 38.6515 8.6775 9.2893 0.5526 14.0091 2.1411 42.8691 58.0119 110.9494 21.9096 21.6892 9.9138 7.7752 34.4664 76.9564 65.1652 4.7931 7.0250 0.3200 0.7400 2.1207 2.9691 6.4627 10.0587 9.5812 6.8027 16.1333 275.6294 144.1634 8.3800 7.6709 133.0517 60.8674 17.3287 33.0227 126.1296 12.5664 51.0650 49.4888 46.2114 21.4714 10.9428 1.1207 1.1326 19.8914 2.1549 1.6142 8.4307 4.5896 19.9086 4.2661 30.1792 6.7303 16.0784 14.4517 48.1173 20.4928 2.3310 0.2925 269.6225 126.9251 13.6023 43.2872 313.3855 34.3473 17.0761 16.1676 6.8271 9.8277 11.9133 6.3286 0.4531 4.6145 15.1456 2.0430 2.6205 3.4335 1.3226 193.8981 39.8673 64.4704
temp: 298.150 k
press: 1.00000 atm
elementType: 16 16 8 8 8 8 8 8 8 8 8 7 6 6 6 6 6 6 6 6 6 6 6 6 6 6 6 6 6 6 6 6 6 1 1 1 1 1 1 1 1 1 1 1 1 1 1 1 1 1
symmnumber: 1
zpe: 895186.7 jmol-1
zpe.correction: 0.340959 hartree
zpe.thermalcorrener: 0.374379 hartree
zpe.thermalcorrenthalpy: 0.375323 hartree
zpe.thermalcorrgfe: 0.269864 hartree
zpe.sumelectzpe: -2335.604529 hartree
zpe.sumelectthermal: -2335.571108 hartree
zpe.sumelectthermalent: -2335.570164 hartree
zpe.sumelectthermalfe: -2335.675623 hartree
dipole: 0.6565 13.4687 1.0721
dipole: 13.5272
quadrupole: -255.9393 -203.3848 -203.5408
quadrupole: -1.4139 -21.0370 2.7856
quadrupole: -34.9844 17.5702 17.4142 -1.4139 -21.0370 2.7856
hfenergy: -2335.9454872 hartree
pointgroup: C01 [X(C21H17N1O9S2)]
dipole: 0.3237823 5.3029345 0.3131306 debye
polarizability: 515.4902736|14.5902533|528.0960783|32.9816789|-8.3981339|276.0685322 unknown
InChI: InChI=1S/C21H15NO3.2HO3S/c1-13-3-2-4-18-19(13)22-20(25)21(18,14-5-9-16(23)10-6-14)15-7-11-17(24)12-8-15;2*1-4(2)3/h2-12,22H,1H3;2*1H
charge 0 multiplicity 1
50 atoms
S  -5.278249 -3.378027 0.032413
S  4.992301 -3.665313 0.548727
O  -0.101395 1.411452 -2.96846
O  -4.836939 -1.490117 0.843018
O  4.772805 -1.995558 -0.689873
O  -6.475192 -3.570306 1.401983
O  6.272291 -4.24953 -0.618556
O  -3.999866 -4.341716 0.242396
O  -6.112735 -3.45344 -1.341423
O  3.666966 -4.582286 0.462018
O  5.708255 -3.439524 1.971883
N  0.152858 3.332337 -1.616341
C  0.043625 1.253969 -0.429067
C  0.114335 2.457448 0.522325
C  0.191515 3.653479 -0.233973
C  0.012747 1.963639 -1.849168
C  -1.248091 0.459011 -0.168133
C  1.304653 0.369572 -0.430609
C  0.098795 2.51398 1.924801
C  0.277074 4.934727 0.353303
C  -1.246668 -0.599854 0.784253
C  1.308177 -0.814803 -1.224606
C  -2.472365 0.823367 -0.797252
C  2.479532 0.733963 0.283442
C  0.182322 3.783593 2.549043
C  0.273001 4.963964 1.772806
C  0.3607 6.194553 -0.486572
C  -2.430679 -1.279195 1.106794
C  2.446751 -1.629653 -1.2873
C  -3.662402 0.147317 -0.493077
C  3.627971 -0.071788 0.227255
C  -3.659107 -0.896208 0.483208
C  3.626932 -1.254951 -0.571788
H  0.20054 4.009127 -2.378496
H  0.020843 1.601745 2.525522
H  -0.306335 -0.900417 1.258278
H  0.414045 -1.080972 -1.796724
H  -2.488318 1.626051 -1.541096
H  2.4864 1.644923 0.889143
H  0.174651 3.854464 3.641348
H  0.33718 5.935119 2.277394
H  0.431979 7.090482 0.15151
H  1.24868 6.18965 -1.148262
H  -0.532275 6.318803 -1.129832
H  -2.436577 -2.102231 1.82815
H  2.457753 -2.546551 -1.884614
H  -4.609019 0.406635 -0.977744
H  4.538366 0.190814 0.775625
H  -6.25458 -2.817634 2.028662
H  6.157949 -3.661912 -1.424535
