program: Gaussian 09
title: 000041189
version: EM64L-G09RevD.01
frameworkgroup: C1[X(C19H25N3O2)]
method: RPBEPBE
basis: SDD
operation: Freq
keyword: #p
keyword: freq=noraman
keyword: PBEPBE/SDD
title: #p freq=noraman PBEPBE/SDD
converged: YES YES NO NO
title: Mulliken charges:
elementType: O O N N N C C C C C C C C C C C C C C C C C C C H H H H H H H H H H H H H H H H H H H H H H H H H
charge: -0.320862 -0.261166 -0.106167 -0.371897 -0.417924 -0.345098 -0.402161 -0.337071 -0.325817 0.134822 0.264228 0.265977 0.139155 0.150454 -0.535819 -0.672476 -0.673330 -0.371287 -0.351457 -0.219320 -0.260368 -0.161808 0.215977 -0.786496 0.196261 0.233934 0.233330 0.244232 0.234621 0.187883 0.204574 0.187476 0.313582 0.281850 0.203949 0.226068 0.206135 0.207029 0.227496 0.205029 0.311237 0.188553 0.296556 0.213232 0.208057 0.208872 0.258798 0.258923 0.212236
chargesum: 0.00000
title: Mulliken charges with hydrogens summed into heavy atoms:
elementType: O O N N N C C C C C C C C C C C C C C C C C C C
charge: -0.320862 -0.261166 -0.106167 -0.058315 -0.121368 0.085096 0.075401 0.085433 0.066233 0.134822 0.264228 0.265977 0.139155 0.150454 -0.253969 -0.036324 -0.033776 -0.060050 -0.162905 -0.006088 -0.052312 0.047064 0.215977 -0.056539
polarizability: 3.45597156e+02 -2.61092941e+01 3.45037959e+02 2.05121531e+01 -1.18458064e+01 1.34357042e+02
1716.lowfreq: -4.9267 -4.1134 -0.0005 -0.0003 0.0006 1.3757 17.5089 20.7740 25.4237
frequency: 15.7724 20.5043 25.2745 40.8332 48.5915 55.5730 60.6276 72.9891 77.4939 87.3649 98.8856 101.1525 143.7253 162.6970 178.3955 187.7869 209.3961 219.3285 245.9164 265.9768 282.5797 300.1732 305.5258 316.7917 331.2093 333.8944 383.0922 390.3960 405.9473 434.4806 450.7071 463.3990 474.5619 507.8896 526.2149 541.3359 575.5458 582.0894 591.3234 610.5193 633.3082 689.7521 705.8021 718.8892 751.8026 753.1702 762.4610 772.3172 795.6358 797.6290 803.2260 862.9102 871.4004 897.2834 904.0120 917.0387 928.1551 944.0862 956.4088 985.7279 989.4398 995.8738 1023.3030 1030.5964 1038.5048 1038.6075 1066.8432 1069.5420 1072.2112 1077.7752 1085.1096 1089.5573 1124.4612 1149.4476 1176.3588 1206.4554 1208.1914 1232.5721 1236.2023 1245.2341 1256.8185 1282.1896 1292.1855 1303.7492 1312.0069 1326.4887 1331.2374 1363.6557 1372.9048 1380.7808 1386.5019 1387.5007 1388.3777 1391.0059 1396.2967 1428.5768 1436.1849 1441.0272 1448.2387 1448.3917 1462.6667 1464.6736 1469.8229 1472.4139 1480.3321 1484.5844 1486.8119 1490.7385 1492.9391 1508.2856 1543.2013 1551.2140 1566.2679 1605.3265 1608.3021 1619.8304 2852.1592 2864.0312 2907.6648 2980.7445 2981.4062 2993.1835 3023.0824 3028.5888 3032.0582 3036.2124 3060.7074 3072.4923 3074.0815 3089.4956 3090.2230 3091.5001 3094.2131 3094.9658 3095.8588 3105.3320 3122.3588 3135.8010 3210.2373 3541.5314 3571.6833
redmass: 4.3388 3.8707 4.6293 4.6633 1.7504 2.9243 3.3679 2.2281 2.9762 3.4968 2.8759 2.5627 3.4690 3.7310 1.7764 3.6745 2.4257 1.5256 3.4579 2.3144 2.1220 2.4748 3.0218 3.1233 3.7839 3.8440 4.5730 3.7741 3.5393 5.9330 3.4342 3.8560 3.5185 1.4625 2.9659 4.0811 2.2392 5.4404 3.2770 1.4949 2.7820 5.8876 3.2605 2.0547 2.5718 1.6956 4.0682 4.7462 1.2945 1.4942 1.3316 1.4170 5.3731 3.7779 1.4820 2.1838 4.5576 3.1533 1.4050 1.8906 2.2788 1.3564 3.4031 1.3624 2.4296 1.9169 1.9057 3.4427 2.7811 1.8800 2.1538 3.5760 1.8060 1.6142 1.7755 2.0836 2.2314 1.3394 2.2419 1.7325 1.6871 1.1559 1.2144 1.1601 1.3289 1.7486 1.3812 1.3278 1.3052 1.3651 1.2805 1.8997 1.2363 1.6443 1.8398 2.1688 2.1501 1.4517 1.7687 1.1886 1.0536 1.0587 1.1055 1.0631 1.0530 1.0789 1.4519 1.2216 1.2135 2.7457 3.3230 7.4804 5.7738 5.6382 6.1577 5.2733 1.0720 1.0714 1.0693 1.0357 1.0357 1.0363 1.0599 1.0871 1.0882 1.0910 1.0854 1.0986 1.0979 1.1003 1.1004 1.1049 1.1002 1.0844 1.0981 1.0896 1.0915 1.0954 1.0964 1.0762 1.0775
irintensity: 2.2349 0.4957 2.2552 3.4191 2.1707 11.5346 1.3529 0.3925 0.8318 1.8312 1.9174 0.1829 1.5533 0.2153 3.8038 1.4542 1.5496 0.6806 1.0481 4.3601 0.6418 0.7854 4.9664 3.5141 4.7671 5.2752 4.1335 1.2264 3.5605 5.3375 14.1597 9.3399 8.5525 61.5869 36.2537 33.7092 0.5627 2.0345 1.7446 57.0447 22.9544 1.8158 3.0211 1.3151 1.8938 72.5757 25.6440 1.4455 10.5160 20.3851 3.0130 0.0101 2.7710 4.6210 32.2269 1.3751 4.5956 12.4895 3.1971 20.0722 2.9699 2.5197 3.7233 3.1145 13.8403 20.3616 18.3871 3.8616 46.7515 26.8922 2.5976 2.3615 9.2277 0.3889 24.9066 20.2636 91.8190 1.0944 86.7343 93.8969 124.9815 7.0889 17.8379 11.5316 6.7477 3.2670 5.5768 5.0900 2.7067 1.9841 47.8767 243.0656 36.7943 69.0083 0.7262 111.8637 36.6516 15.1129 5.2271 16.7686 9.3425 1.6805 11.6495 15.3939 7.3609 5.6862 245.4423 73.0534 80.5436 267.7745 131.4322 71.0726 75.7795 59.7567 209.3732 76.2724 54.9359 134.4067 70.3373 42.2055 29.1120 16.2375 45.1498 1.5601 23.6203 25.7254 29.0179 26.8357 97.0489 41.1876 46.2669 14.8655 19.5526 8.6866 7.9333 20.8143 15.5770 54.4002 4.1721 7.1419 15.5261
temp: 298.150 k
press: 1.00000 atm
elementType: 8 8 7 7 7 6 6 6 6 6 6 6 6 6 6 6 6 6 6 6 6 6 6 6 1 1 1 1 1 1 1 1 1 1 1 1 1 1 1 1 1 1 1 1 1 1 1 1 1
symmnumber: 1
zpe: 1068052.3 jmol-1
zpe.correction: 0.406800 hartree
zpe.thermalcorrener: 0.431926 hartree
zpe.thermalcorrenthalpy: 0.432870 hartree
zpe.thermalcorrgfe: 0.348255 hartree
zpe.sumelectzpe: -1051.925736 hartree
zpe.sumelectthermal: -1051.900610 hartree
zpe.sumelectthermalent: -1051.899666 hartree
zpe.sumelectthermalfe: -1051.984281 hartree
dipole: 5.0998 -0.1185 1.6215
dipole: 5.3527
quadrupole: -102.2639 -139.9752 -148.4517
quadrupole: -2.9956 0.3083 -0.8752
quadrupole: 27.9664 -9.7450 -18.2214 -2.9956 0.3083 -0.8752
hfenergy: -1052.332536 hartree
pointgroup: C01 [X(C19H25N3O2)]
dipole: -1.9690255 0.6650366 0.339793 debye
polarizability: 338.8321212|-36.1706123|263.5448578|-1.6011139|-106.2628023|222.6151786 unknown
InChI: InChI=1S/C19H25N3O2/c1-4-22(5-2)12-11-20-19(24)17-13-18(21-14(3)23)16-10-8-6-7-9-15(16)17/h6-10,13,20-21H,4-5,11-12H2,1-3H3
charge 0 multiplicity 1
49 atoms
O  1.449424 0.847761 -1.468314
O  -2.766876 -2.4849 2.213232
N  5.161373 -0.430778 0.512883
N  1.43423 -0.965588 -0.024684
N  -3.896731 -0.780687 1.071354
C  3.716811 -0.342952 0.835176
C  2.881607 -1.180743 -0.16895
C  5.562976 0.546455 -0.538977
C  6.045335 -0.400022 1.707288
C  -0.67116 0.1961 -0.451815
C  -1.535163 1.182844 -1.035102
C  -2.918822 0.924847 -0.507251
C  -2.812169 -0.208831 0.36828
C  0.790846 0.069009 -0.690737
C  -1.460305 -0.639895 0.398157
C  6.773621 0.074185 -1.366045
C  6.033236 -1.723881 2.495553
C  -1.140167 2.194052 -1.930821
C  -4.096511 1.638464 -0.795747
C  -1.932215 3.199425 -2.543279
C  -4.284252 2.757491 -1.639342
C  -3.317284 3.445942 -2.41377
C  -3.842424 -1.868381 1.9457
C  -5.180634 -2.267903 2.560856
H  3.546839 -0.726991 1.857921
H  3.343684 0.707769 0.814433
H  3.110767 -2.252515 -0.036014
H  3.161008 -0.893828 -1.196868
H  4.6997 0.690354 -1.214571
H  5.777072 1.55048 -0.092482
H  7.076344 -0.212063 1.355465
H  5.784789 0.449586 2.389048
H  0.907385 -1.566665 0.608397
H  -1.136784 -1.488741 1.000076
H  7.671709 -0.071094 -0.737949
H  6.545337 -0.887129 -1.858426
H  7.024927 0.820591 -2.14291
H  5.026208 -1.962447 2.88425
H  6.351231 -2.555313 1.842603
H  6.720172 -1.667032 3.36088
H  -0.06854 2.180061 -2.171462
H  -5.017655 1.290594 -0.300716
H  -4.814434 -0.357341 0.92548
H  -1.389899 3.880967 -3.21175
H  -5.310176 3.14254 -1.702627
H  -3.702755 4.294507 -2.996915
H  -5.099453 -2.219372 3.660501
H  -5.398988 -3.317106 2.296544
H  -6.028735 -1.637827 2.239748
