program: Gaussian 09
title: 000005374
version: EM64L-G09RevD.01
frameworkgroup: C1[X(C10H15N3S)]
method: RPBEPBE
basis: SDD
operation: Freq
keyword: #p
keyword: freq=noraman
keyword: PBEPBE/SDD
title: #p freq=noraman PBEPBE/SDD
converged: YES YES NO NO
title: Mulliken charges:
elementType: S N N N C C C C C C C C C C H H H H H H H H H H H H H H H
charge: 0.195515 -0.087970 -0.073802 -0.573768 -0.356124 -0.372219 -0.453884 -0.469520 -0.348682 0.365341 -0.420497 -0.186500 -0.057248 -0.581569 0.199606 0.193428 0.198330 0.226842 0.228583 0.198584 0.219818 0.224018 0.190887 0.213187 0.237070 0.330958 0.323566 0.217285 0.218764
chargesum: 0.00000
title: Mulliken charges with hydrogens summed into heavy atoms:
elementType: S N N N C C C C C C C C C C
charge: 0.195515 -0.087970 -0.073802 0.080757 0.036911 0.052953 -0.026718 -0.025684 -0.348682 0.365341 -0.016424 -0.186500 0.179822 -0.145519
polarizability: 2.00539710e+02 5.39814884e+00 1.39811253e+02 -3.80987539e+00 2.13715369e+00 8.99670595e+01
1716.lowfreq: -20.1566 -4.9079 -0.0013 -0.0005 0.0019 5.6733 30.2899 66.0918 71.6631
frequency: 30.1666 66.0651 71.6245 116.3379 122.3088 168.6037 200.7906 236.9563 238.9017 252.9640 281.0770 311.8936 350.2976 374.7732 390.1377 401.9722 428.8713 443.1257 495.5868 530.7047 561.0998 569.8609 579.1317 619.6107 629.1586 695.7919 739.7865 823.3786 897.7029 904.4598 927.8576 945.9349 952.1748 989.2114 993.0408 1015.8875 1041.7753 1047.6642 1065.6067 1115.2319 1128.1849 1151.1427 1167.3032 1187.7906 1219.9327 1234.3077 1255.8650 1270.3817 1274.8724 1296.6739 1313.7618 1319.4842 1342.6083 1350.2518 1370.9427 1390.3429 1426.7763 1441.4939 1447.4694 1449.9700 1462.5389 1470.7930 1565.1233 1581.8780 1624.4131 1656.9352 2854.6491 2861.6676 2873.0012 2973.9746 2985.7088 2988.8756 3018.1807 3037.3061 3040.8185 3061.8323 3084.4831 3103.8867 3195.2831 3562.4902 3715.4350
redmass: 4.4569 3.0108 3.1516 2.7287 3.5822 3.8567 3.0431 2.9407 3.4747 1.5436 1.8407 2.6061 2.6696 2.4927 1.5954 1.8740 2.8935 2.6535 5.4396 2.1856 4.0326 5.2290 5.3672 1.7113 4.2021 4.0173 2.9662 2.7093 1.8792 2.2046 2.2383 1.6555 1.5642 2.1437 1.7914 1.2617 2.5949 2.6157 2.5910 2.3639 2.1277 2.5440 2.8346 1.1597 1.3147 1.2350 2.2328 1.5829 1.4690 1.4529 1.5192 1.2807 1.3779 1.7513 1.6022 1.3586 1.2075 1.0920 1.1142 1.0863 1.0814 1.1048 3.0640 3.4491 1.9876 4.7342 1.0691 1.0713 1.0688 1.0630 1.0636 1.0876 1.0900 1.0898 1.0966 1.0964 1.0600 1.0940 1.1141 1.0449 1.1047
irintensity: 0.5308 0.7759 0.1181 1.9565 1.3774 0.8182 6.9978 9.1940 5.7315 49.7869 46.9493 21.3617 5.4831 38.1106 123.6794 45.9024 14.5229 1.2805 1.5532 8.7832 5.7355 6.1675 13.7265 13.4048 0.4133 1.2596 7.2352 12.1627 0.7760 5.1563 7.5407 106.7405 26.5687 8.6911 13.9816 20.8263 10.6288 0.5474 3.5749 54.7974 1.9665 8.2114 13.7419 2.0765 5.7789 13.2783 104.8194 3.8512 3.0808 17.6133 11.1284 27.5691 10.1025 15.5084 11.9785 1.3230 16.6402 11.0611 12.1885 1.1934 3.6543 15.6139 104.8642 0.7871 420.7181 7.4843 39.1648 34.3196 185.6309 25.6100 24.5755 15.4817 63.5787 28.0487 18.6220 15.0081 13.6200 8.9386 27.6981 108.5832 44.5838
temp: 298.150 k
press: 1.00000 atm
elementType: 16 7 7 7 6 6 6 6 6 6 6 6 6 6 1 1 1 1 1 1 1 1 1 1 1 1 1 1 1
symmnumber: 1
zpe: 624369.1 jmol-1
zpe.correction: 0.237810 hartree
zpe.thermalcorrener: 0.252167 hartree
zpe.thermalcorrenthalpy: 0.253111 hartree
zpe.thermalcorrgfe: 0.196339 hartree
zpe.sumelectzpe: -951.268085 hartree
zpe.sumelectthermal: -951.253728 hartree
zpe.sumelectthermalent: -951.252784 hartree
zpe.sumelectthermalfe: -951.309556 hartree
dipole: 1.0618 0.5649 -0.9388
dipole: 1.5257
quadrupole: -72.0707 -89.2537 -93.0576
quadrupole: -3.1175 -1.7905 0.3289
quadrupole: 12.7233 -4.4597 -8.2636 -3.1175 -1.7905 0.3289
hfenergy: -951.505895 hartree
pointgroup: C01 [X(C10H15N3S1)]
dipole: 0.4098374 0.2313266 -0.3725912 debye
polarizability: 199.9996319|7.9158615|140.4602942|-3.4510438|0.8102969|89.8580967 unknown
InChI: InChI=1S/C10H15N3S/c1-2-5-13-6-3-8-9(4-7-13)14-10(11)12-8/h2H,1,3-7,11H2
charge 0 multiplicity 1
29 atoms
S  3.109413 1.358219 -0.07966
N  -1.795979 0.471818 0.01727
N  2.474252 -1.241516 0.09016
N  4.806118 -0.868348 -0.318858
C  -0.985523 1.634106 -0.428115
C  -1.208399 -0.84953 -0.337742
C  0.284054 1.884819 0.425996
C  -0.007871 -1.274143 0.537501
C  1.373088 0.861518 0.229778
C  1.276892 -0.517871 0.281022
C  -3.213621 0.578483 -0.430708
C  3.511659 -0.443828 -0.103599
C  -4.127969 -0.351944 0.341023
C  -5.070066 -1.153754 -0.215229
H  -1.625112 2.533113 -0.339698
H  -0.683228 1.541387 -1.501805
H  -0.904598 -0.875879 -1.414872
H  -2.006658 -1.60178 -0.20254
H  -0.02711 1.915873 1.49014
H  0.666246 2.891767 0.173577
H  0.202352 -2.343529 0.355936
H  -0.309369 -1.171611 1.598757
H  -3.336331 0.399079 -1.528834
H  -3.536787 1.622107 -0.238883
H  -3.995454 -0.325226 1.4327
H  4.983623 -1.869892 -0.326793
H  5.570286 -0.216088 -0.460061
H  -5.730471 -1.776069 0.398987
H  -5.209838 -1.206981 -1.302648
