program: Gaussian 09
title: 000041246
version: EM64L-G09RevD.01
frameworkgroup: C1[X(C19H30N2O2)]
method: RPBEPBE
basis: SDD
operation: Freq
keyword: #p
keyword: freq=noraman
keyword: PBEPBE/SDD
title: #p freq=noraman PBEPBE/SDD
converged: YES YES NO NO
title: Mulliken charges:
elementType: O O N N C C C C C C C C C C C C C C C C C C C H H H H H H H H H H H H H H H H H H H H H H H H H H H H H H
charge: -0.266046 -0.268614 -0.115439 -0.230128 -0.398749 -0.037327 -0.029164 -0.400805 0.332681 -0.602804 -0.377666 0.397585 -0.553846 0.153186 -0.692675 -0.696957 -0.702408 -0.701889 -0.524110 -0.430702 0.337043 -0.386077 -0.536519 0.247359 0.201382 0.198750 0.189865 0.218671 0.260717 0.220803 0.238696 0.216073 0.226192 0.247030 0.246466 0.207332 0.209643 0.217362 0.229011 0.207597 0.202650 0.230059 0.211151 0.210623 0.248079 0.196717 0.217771 0.268793 0.233372 0.242067 0.220269 0.245864 0.221065
chargesum: 0.00000
title: Mulliken charges with hydrogens summed into heavy atoms:
elementType: O O N N C C C C C C C C C C C C C C C C C C C
charge: -0.266046 -0.268614 -0.115439 -0.230128 0.049992 0.161423 0.160701 0.078582 0.332681 -0.143305 0.064600 0.397585 -0.060350 0.153186 -0.058338 -0.057699 -0.050575 -0.039321 -0.255317 -0.197329 0.337043 -0.144010 0.150680
polarizability: 2.63958330e+02 3.23678850e+01 2.47276929e+02 -1.70343147e+01 9.13809812e+00 1.86057042e+02
1716.lowfreq: -15.9814 -9.4363 -5.7157 -0.0006 -0.0002 0.0008 10.6990 16.6730 28.6002
frequency: 3.7826 16.5957 28.4236 38.9069 50.2222 68.5779 84.2769 98.8829 102.0736 105.5698 127.1335 165.8410 187.5552 192.5578 194.9676 203.7979 225.1219 243.8117 244.2369 253.7326 260.7916 265.4556 287.7378 317.6510 322.5962 343.6733 358.8390 365.9476 371.2092 391.5389 398.0540 452.4996 456.3812 474.3356 479.1320 513.0875 535.8803 554.3834 564.3441 603.6145 639.3593 679.1760 692.4575 716.1182 734.2417 749.6370 768.6725 783.7690 807.7426 825.6213 840.3331 874.9028 876.9178 881.9460 901.7858 904.7234 918.4853 924.4791 926.7778 935.5017 960.5489 990.4474 1007.3563 1019.8692 1035.1479 1043.6941 1062.7950 1067.1774 1093.7765 1111.3320 1115.8253 1117.6936 1123.4466 1140.2940 1152.1929 1154.1441 1163.6123 1165.6741 1174.8799 1196.3694 1213.0111 1215.4920 1239.0419 1259.2505 1266.4281 1291.6966 1294.3621 1297.9409 1299.4804 1305.3438 1322.3215 1328.6149 1338.9022 1349.2943 1364.9885 1366.8937 1368.7735 1378.0067 1382.5419 1383.4926 1389.9751 1394.0553 1427.3447 1437.3803 1444.4100 1455.3949 1456.7377 1462.8883 1465.7918 1466.0988 1467.4905 1468.3737 1472.6142 1473.8961 1475.0168 1476.9614 1484.8166 1487.3646 1491.0273 1493.6936 1573.7344 1579.6453 1624.7173 2924.1786 2958.8652 2964.4585 2968.3964 2972.7562 2975.4596 2976.9354 2978.5903 2989.8834 3005.1039 3007.1352 3038.8200 3043.2583 3046.3424 3053.4534 3057.1656 3061.5580 3063.3830 3067.4824 3072.7733 3074.4088 3083.2092 3088.1525 3090.3918 3090.7603 3110.2595 3124.5181 3125.9773 3162.8932 3166.0621
redmass: 3.6713 3.4515 3.0678 3.5422 3.5741 3.1571 2.8676 4.3281 3.6144 3.5315 3.7351 3.0981 1.1483 1.1603 2.4560 1.9370 2.4598 2.1685 1.5956 1.2579 1.3786 1.8012 2.3285 3.2069 2.5264 3.6169 2.8177 3.8504 4.1355 2.6107 3.0096 4.2277 2.7397 3.6597 3.1667 3.0428 3.0892 2.6228 3.5097 3.9865 3.9538 5.5277 3.1731 3.6799 2.8744 1.5975 2.0841 1.9208 1.5811 2.8058 2.7987 2.1392 1.7207 2.8981 1.2810 1.3782 2.3236 1.3148 1.3120 1.3555 2.7001 2.2098 3.2050 4.1380 2.0325 2.3136 2.2936 2.2453 2.2296 1.2604 2.0105 1.9829 2.1578 1.6641 1.7506 1.2541 1.7975 1.4886 1.5991 1.8510 3.0841 2.6344 1.3825 1.8816 1.7659 1.5667 1.2800 1.3627 1.5593 1.3588 1.2564 1.3827 1.6572 1.9834 1.2820 1.2157 1.3896 1.2218 1.2560 5.7378 1.2511 1.2439 2.4188 1.3654 1.1664 1.0912 1.0481 1.0473 1.0613 1.0504 1.0715 1.1037 1.0750 1.0503 1.1055 1.0514 1.0589 1.0539 1.0583 2.8768 7.2441 7.5562 7.0999 1.0691 1.0330 1.0834 1.0356 1.0354 1.0635 1.0360 1.0359 1.0605 1.0843 1.0645 1.0608 1.0965 1.1039 1.0879 1.1024 1.0995 1.0993 1.0993 1.0992 1.0988 1.1002 1.1000 1.1002 1.0990 1.1067 1.0957 1.0926 1.0918 1.0940
irintensity: 0.1680 0.5186 0.1385 1.1408 0.6643 0.7303 1.4246 0.3573 5.3699 3.0796 0.9817 0.0717 0.0471 0.3354 3.3385 2.3784 1.9750 1.3062 0.0777 0.1856 0.8696 0.7925 0.6522 2.3438 0.5972 4.0229 3.5894 2.3809 4.0268 0.3937 3.2858 7.2673 3.2544 9.0210 13.4687 6.0745 20.7053 4.1525 7.0448 1.6930 3.8811 1.9175 10.8755 8.6626 7.1189 2.3919 10.4517 6.0292 29.5860 5.5125 5.8369 15.5875 10.2982 2.7640 1.0592 1.7995 14.7385 0.2084 1.7812 0.4631 2.4483 3.6364 66.7034 14.3174 0.4306 0.3282 19.9985 42.0425 11.3548 0.2385 29.3841 25.8932 21.0586 20.5105 60.2251 31.5683 54.2887 12.0015 148.7183 10.8277 24.2015 70.8637 60.3488 9.3100 112.3616 4.0905 19.8485 8.2352 20.4263 4.5974 8.6692 3.0707 11.2646 63.5119 35.7931 9.1049 15.7936 20.4161 7.0047 19.3351 27.8211 29.3083 12.6433 10.3890 16.5731 9.4394 1.3188 1.0154 0.2554 14.0950 14.0707 8.1494 64.0075 9.0512 11.8264 8.8271 3.0670 20.0604 17.9902 118.9649 64.7679 362.6947 67.5276 43.5459 76.0142 29.9307 24.5126 26.0514 21.9313 27.4224 25.9989 53.5055 21.0196 13.3998 15.6170 28.2646 47.9267 9.4777 36.9239 7.5774 4.7469 57.0755 11.2679 159.2739 25.7799 42.1550 17.6407 39.0549 11.0774 35.0194 3.1741 4.7202 10.2329
temp: 298.150 k
press: 1.00000 atm
elementType: 8 8 7 7 6 6 6 6 6 6 6 6 6 6 6 6 6 6 6 6 6 6 6 1 1 1 1 1 1 1 1 1 1 1 1 1 1 1 1 1 1 1 1 1 1 1 1 1 1 1 1 1 1
symmnumber: 1
zpe: 1201111.0 jmol-1
zpe.correction: 0.457479 hartree
zpe.thermalcorrener: 0.482601 hartree
zpe.thermalcorrenthalpy: 0.483545 hartree
zpe.thermalcorrgfe: 0.399547 hartree
zpe.sumelectzpe: -1000.169851 hartree
zpe.sumelectthermal: -1000.144729 hartree
zpe.sumelectthermalent: -1000.143785 hartree
zpe.sumelectthermalfe: -1000.227783 hartree
dipole: -3.6489 -2.5036 2.7164
dipole: 5.1924
quadrupole: -120.9353 -139.7306 -143.2123
quadrupole: 0.4109 -2.0988 5.3953
quadrupole: 13.6908 -5.1045 -8.5863 0.4109 -2.0988 5.3953
hfenergy: -1000.6273299 hartree
pointgroup: C01 [X(C19H30N2O2)]
dipole: 1.2946113 1.4848777 0.5407295 debye
polarizability: 253.3696083|35.0359308|248.3216687|2.5879504|-29.0844445|195.6010242 unknown
InChI: InChI=1S/C19H30N2O2/c1-14(2)20(15(3)4)11-12-21-18-13-17(23-5)10-9-16(18)7-6-8-19(21)22/h9-10,13-15H,6-8,11-12H2,1-5H3
charge 0 multiplicity 1
53 atoms
O  -0.339547 -3.075575 -0.259015
O  3.071228 2.814104 -2.172303
N  -3.024766 0.284622 0.161363
N  0.54686 -0.926667 -0.42315
C  -1.692698 -0.230952 0.50404
C  -3.179155 1.760961 0.214023
C  -4.192384 -0.596722 0.425743
C  -0.811747 -0.417208 -0.763881
C  1.647517 -0.007865 -0.268083
C  2.197476 -1.093717 1.980848
C  2.538442 -2.54659 1.542978
C  2.477394 -0.067941 0.897165
C  2.080826 -2.830413 0.083287
C  0.673369 -2.308109 -0.200899
C  -3.513601 2.332874 1.624712
C  -4.185662 2.282487 -0.838892
C  -4.352055 -1.050481 1.908675
C  -4.160591 -1.833502 -0.507997
C  1.8818 0.96701 -1.261845
C  3.536966 0.858157 1.001409
C  2.940735 1.893413 -1.119102
C  3.784563 1.842242 0.016772
C  4.169432 3.779239 -2.089167
H  -1.774709 -1.215488 0.996813
H  -1.161022 0.443552 1.212354
H  -2.18417 2.163619 -0.06971
H  -5.089621 -0.003447 0.163609
H  -0.713896 0.544102 -1.294219
H  -1.304425 -1.145425 -1.428172
H  2.759499 -0.840637 2.898035
H  1.120373 -1.055008 2.240925
H  3.629975 -2.718613 1.605978
H  2.051469 -3.258678 2.23535
H  2.066878 -3.916422 -0.105496
H  2.797655 -2.364437 -0.618117
H  -3.448591 3.437644 1.622157
H  -4.538878 2.057307 1.933613
H  -2.8078 1.949662 2.385004
H  -3.928567 1.893599 -1.839608
H  -4.170122 3.387847 -0.869834
H  -5.221759 1.975121 -0.604101
H  -4.374823 -0.188093 2.596788
H  -3.524317 -1.71701 2.215383
H  -5.293349 -1.618528 2.033496
H  -3.252696 -2.440976 -0.3338
H  -5.040312 -2.48048 -0.330497
H  -4.162193 -1.515512 -1.565459
H  1.271207 1.011185 -2.168326
H  4.178751 0.824028 1.890066
H  4.611251 2.545881 0.148533
H  4.067529 4.43042 -1.199056
H  4.088243 4.385963 -3.002905
H  5.152817 3.270259 -2.065386
